program: Orca
programVersion: 4.2.1
elementType: Cl Cl O O O C C C C C C C C C C H H H H H H H H H H
charge: 0
multiplicity: 1
keywords: wb97x-d3
keywords: def2-TZVPP
keywords: def2/J RIJCOSX GRIDX6 NOFINALGRIDX
keywords: grid4 nofinalgrid
keywords: scfconv7
keywords: smallprint printgap noloewdin
keywords: NOSOSCF
formula: C10H10Cl2O3
InChI: InChI=1/C10H10Cl2O3/c11-7-3-4-9(8(12)6-7)15-5-1-2-10(13)14/h3-4,6,13H,1-2,5H2
25 atoms
Cl -0.030716 1.589477 1.529834
Cl -4.526464 0.117189 -1.019577
O  1.036316 -0.857512 0.513294
O  3.412036 1.235073 0.894016
O  2.55662 1.370005 -1.159794
C  3.242007 -1.701394 0.338954
C  1.782637 -1.982247 0.064952
C  3.814472 -0.587241 -0.53941
C  -0.234532 -0.708584 0.131482
C  3.179257 0.75902 -0.326173
C  -0.886301 0.457432 0.547832
C  -0.951651 -1.619081 -0.638725
C  -2.198971 0.715715 0.20377
C  -2.268825 -1.368387 -0.995854
C  -2.883497 -0.203911 -0.576489
H  3.796652 -2.617297 0.127829
H  3.393415 -1.486308 1.398818
H  1.453571 -2.882983 0.592324
H  1.631829 -2.144771 -1.007372
H  3.704825 -0.852173 -1.591399
H  4.88509 -0.494971 -0.338578
H  -0.499128 -2.543094 -0.9710
H  -2.677331 1.62544 0.539746
H  -2.801545 -2.090249 -1.599528
H  2.967273 2.088556 1.003339
elementType: Cl O C H
totalener: -1533.27813880 hartree
nucrepener: 1214.42197394 hartree
electener: -2747.70011274 hartree
oneelecener: -4520.42496997 hartree
twoeener: 1772.72485723 hartree
cpcmener: -0.02434549 hartree
kineticenergy: 1529.35945235 hartree
xcener: -100.035292537134 hartree
chargesum: -0.0000000
charge: -0.088769 -0.097728 -0.304336 -0.297791 -0.439015 -0.124004 -0.020429 -0.113446 0.336336 0.372369 -0.053111 -0.220678 -0.090748 -0.165026 0.048022 0.090523 0.084035 0.124870 0.102840 0.082991 0.113055 0.143750 0.125582 0.144946 0.245766
qa: -0.0888 -0.0977 -0.3043 -0.2978 -0.4390 -0.1240 -0.0204 -0.1134 0.3363 0.3724 -0.0531 -0.2207 -0.0907 -0.1650 0.0480 0.0905 0.0840 0.1249 0.1028 0.0830 0.1131 0.1438 0.1256 0.1449 0.2458
va: 1.2308 1.2050 2.0996 2.1661 2.0502 3.9195 3.8782 3.8232 3.7834 4.2499 3.9334 3.9359 3.9991 4.0316 3.8686 1.0125 1.0248 0.9913 0.9866 1.0279 1.0131 1.0065 1.0175 1.0041 1.0075
dispcorr: -0.011996074 hartree
energy: -1533.290134874946
dipole: 21.15829 -19.87249 1.28580 -13.01337 11.14683 -1.86654 -2.37757 2.65923 0.28166
magnitude: 2.28399 au
magnitude: 5.80543 debye
