program: Orca
programVersion: 4.2.1
elementType: Cl Cl O O O C C C C C C C C C C H H H H H H H H H H
charge: 0
multiplicity: 1
keywords: wb97x-d3
keywords: def2-TZVPP
keywords: def2/J RIJCOSX GRIDX6 NOFINALGRIDX
keywords: grid4 nofinalgrid
keywords: scfconv7
keywords: smallprint printgap noloewdin
keywords: NOSOSCF
formula: C10H10Cl2O3
InChI: InChI=1/C10H10Cl2O3/c11-7-3-4-9(8(12)6-7)15-5-1-2-10(13)14/h3-4,6,13H,1-2,5H2
25 atoms
Cl -0.620402 -0.438657 -3.060669
Cl -3.934031 0.017086 1.141213
O  1.297153 0.811109 -1.371149
O  1.799213 -1.635592 2.675956
O  2.865965 0.298653 2.38501
C  3.291116 -0.191216 -0.399087
C  2.511598 1.081119 -0.690625
C  2.613411 -1.201983 0.514898
C  0.139546 0.65259 -0.716385
C  2.452646 -0.737674 1.93727
C  -0.904702 0.062259 -1.438277
C  -0.116407 1.042709 0.594635
C  -2.15254 -0.130313 -0.876477
C  -1.364171 0.847658 1.16753
C  -2.377967 0.263261 0.432792
H  4.253603 0.103859 0.024966
H  3.510301 -0.68543 -1.347888
H  3.092414 1.700351 -1.375169
H  2.361082 1.671455 0.213322
H  3.205807 -2.122104 0.537307
H  1.638908 -1.510246 0.12785
H  0.649319 1.51035 1.19629
H  -2.938743 -0.589242 -1.458886
H  -1.539155 1.159918 2.187337
H  1.730633 -1.300084 3.579523
totalener: -1533.25686606 hartree
nucrepener: 1210.82135872 hartree
electener: -2744.07822478 hartree
oneelecener: -4512.47001097 hartree
twoeener: 1768.39178619 hartree
kineticenergy: 1529.39476873 hartree
xcener: -100.039711977163 hartree
chargesum: -0.0000000
charge: -0.063218 -0.080903 -0.290324 -0.259970 -0.354890 -0.094617 -0.045230 -0.169726 0.229380 0.326517 -0.027676 -0.173236 -0.094765 -0.152366 0.061167 0.077483 0.085433 0.108830 0.114232 0.111952 0.115241 0.135429 0.113361 0.122219 0.205678
qa: -0.0632 -0.0809 -0.2903 -0.2600 -0.3549 -0.0946 -0.0452 -0.1697 0.2294 0.3265 -0.0277 -0.1732 -0.0948 -0.1524 0.0612 0.0775 0.0854 0.1088 0.1142 0.1120 0.1152 0.1354 0.1134 0.1222 0.2057
va: 1.2522 1.2223 2.1021 2.2066 2.1216 3.8653 3.9261 3.8417 3.8536 4.2679 3.9487 3.8481 4.0212 4.0643 3.9210 1.0234 1.0152 0.9992 0.9987 1.0166 1.0089 1.0144 1.0234 1.0129 1.0405
dispcorr: -0.012580959 hartree
energy: -1533.269447022890
dipole: 21.20084 -20.31342 0.88742 0.58568 -0.86067 -0.27500 6.06018 -5.59733 0.46285
magnitude: 1.03796 au
magnitude: 2.63829 debye
