program: Gaussian 09
title: 000059272
version: EM64L-G09RevD.01
frameworkgroup: C1[X(C19H22N2O2)]
method: RPBEPBE
basis: SDD
operation: Freq
keyword: #p
keyword: freq=noraman
keyword: PBEPBE/SDD
title: #p freq=noraman PBEPBE/SDD
converged: YES YES NO NO
title: Mulliken charges:
elementType: O O N N C C C C C C C C C C C C C C C C C C C H H H H H H H H H H H H H H H H H H H H H H
charge: -0.285636 -0.290270 -0.106438 -0.685204 -0.012409 -0.284229 -0.485148 -0.559274 0.330519 0.277324 -0.403365 -0.385154 -0.662035 -0.632466 -0.257237 -0.245305 0.201740 0.230761 -0.339274 -0.323690 -0.409603 -0.402474 0.500525 0.178422 0.295271 0.245647 0.207002 0.225713 0.222232 0.273146 0.230591 0.277669 0.187903 0.215561 0.220589 0.184894 0.224845 0.227283 0.225302 0.264198 0.263279 0.219947 0.218669 0.310069 0.310108
chargesum: 0.00000
title: Mulliken charges with hydrogens summed into heavy atoms:
elementType: O O N N C C C C C C C C C C C C C C C C C C C
charge: -0.285636 -0.290270 -0.106438 -0.065026 0.166013 0.011042 -0.032499 -0.111330 0.330519 0.277324 -0.130220 -0.154563 0.019099 -0.002138 -0.029954 -0.020003 0.201740 0.230761 -0.075075 -0.060411 -0.189656 -0.183806 0.500525
polarizability: 2.92572967e+02 5.27925316e+00 2.04082466e+02 1.22321784e+00 -1.39120877e+01 2.05030623e+02
1716.lowfreq: -10.3855 -2.4896 -0.4078 -0.0007 -0.0004 0.0000 17.6284 21.0400 44.5755
frequency: 16.5772 20.8395 44.5527 47.5227 63.0223 73.0454 101.6985 109.9355 147.8872 178.2697 181.7517 195.9622 227.4241 242.5854 267.4240 280.4900 290.6971 318.4329 318.8960 347.2771 357.9731 373.0458 406.1805 408.6268 414.8163 427.2207 442.3050 467.6825 480.2026 495.0655 506.7999 552.2484 578.2672 605.1138 627.7569 632.0498 644.9842 674.3278 728.8560 737.9296 753.5394 768.9462 791.7924 806.5100 823.3759 829.5200 842.4154 843.1101 861.6725 888.2187 893.5342 930.3441 964.0948 973.2767 981.9313 993.5560 995.7721 1010.0627 1017.0907 1033.7916 1034.5994 1044.2791 1054.7698 1061.3645 1084.9023 1109.7743 1117.2788 1129.9427 1132.5347 1163.1480 1174.9573 1180.0747 1195.2802 1207.7483 1215.6493 1224.5714 1253.4716 1255.6521 1266.3332 1307.9528 1308.4043 1320.3207 1323.9438 1325.5987 1340.6340 1350.7557 1373.3421 1389.8898 1391.4964 1422.5190 1442.2309 1447.4566 1453.4703 1454.3614 1465.1465 1468.4049 1478.3331 1483.0097 1489.7536 1495.5651 1515.2757 1567.5972 1591.9154 1598.3378 1614.2929 1631.1338 1645.8575 2780.6030 2838.5307 2855.6485 2954.7470 3013.5789 3027.7284 3034.5202 3037.5532 3057.7477 3080.4047 3092.4843 3098.2061 3110.6315 3123.4759 3126.3528 3127.0235 3139.1368 3158.9838 3159.1651 3177.3074 3561.2024 3701.1440
redmass: 4.6393 4.5758 3.5442 3.3400 4.7895 3.9083 4.8148 5.1679 3.6461 2.8845 2.7808 1.3235 3.4304 2.8492 1.4650 5.2542 4.0866 3.1121 3.6492 3.1305 5.2299 3.2191 1.2029 1.1700 2.2876 2.8795 2.9235 3.2078 3.7136 3.1183 2.8722 3.8672 3.9089 5.8023 5.6019 6.3333 3.7584 4.1033 2.7709 3.5149 4.4191 1.5876 5.2640 2.8580 1.2674 5.8038 1.9860 3.1828 2.9275 1.4873 2.9864 2.9803 1.4072 1.3681 1.3524 1.3316 3.3478 2.3390 1.4989 2.4981 1.6258 2.2742 3.4398 2.1285 1.3561 1.7378 1.8460 1.2151 1.4076 1.6132 1.0716 1.1618 1.7134 2.3875 1.8845 1.8179 2.7569 1.8077 1.7287 1.3775 1.3350 1.4960 1.3569 2.9489 1.4852 1.4454 2.0172 3.0339 4.7599 1.1424 2.3595 4.2352 1.1459 1.1506 1.0813 1.0550 1.0576 1.0696 1.9028 1.1560 3.2044 7.4968 6.8322 8.9656 6.3358 3.3775 1.4089 1.0786 1.0583 1.0582 1.0655 1.0771 1.0767 1.0717 1.0724 1.0849 1.1034 1.0983 1.0991 1.0871 1.0894 1.0894 1.0880 1.0941 1.0959 1.1000 1.0946 1.0450 1.1040
irintensity: 1.9345 0.5308 0.0082 1.8078 1.7150 1.8586 0.6874 0.2831 0.5855 0.4937 0.2474 1.1334 1.9257 1.6294 0.2026 10.3581 9.3293 7.4126 2.1974 2.3103 1.5132 6.1858 223.4679 82.4641 0.3747 5.8638 3.8712 0.4440 9.0501 0.9385 3.3244 17.6122 0.9522 7.6975 11.6687 1.6886 0.1676 27.9942 6.5692 7.5647 12.0755 51.9738 39.7004 35.8628 0.3599 6.0198 60.2496 7.8708 53.5240 8.0324 34.5862 31.6131 2.3895 0.0732 0.3439 0.4309 61.3879 53.5442 9.4433 44.0462 46.2771 42.2486 258.6685 17.9256 1.9117 17.3738 10.8379 14.2584 6.4134 22.9377 10.1236 183.7247 3.8368 6.5426 4.5019 18.5375 343.4708 5.4598 8.1632 2.2138 4.4388 5.0604 2.6550 160.3665 8.1428 5.1994 14.6525 1.8918 13.5089 1.4778 4.9383 6.7553 11.3508 7.1394 5.1748 13.5352 20.2204 6.7784 5.0844 45.3126 84.0335 62.6426 17.8794 236.5208 4.7298 129.7076 348.3978 89.2340 81.3949 212.2402 31.9023 10.5876 24.4437 38.7100 56.4775 15.2782 38.9087 34.7082 23.9624 10.2166 15.4921 24.9653 5.3985 20.6870 11.9940 32.7049 3.4873 115.5682 22.5652
temp: 298.150 k
press: 1.00000 atm
elementType: 8 8 7 7 6 6 6 6 6 6 6 6 6 6 6 6 6 6 6 6 6 6 6 1 1 1 1 1 1 1 1 1 1 1 1 1 1 1 1 1 1 1 1 1 1
symmnumber: 1
zpe: 974345.2 jmol-1
zpe.correction: 0.371109 hartree
zpe.thermalcorrener: 0.392451 hartree
zpe.thermalcorrenthalpy: 0.393395 hartree
zpe.thermalcorrgfe: 0.319385 hartree
zpe.sumelectzpe: -995.500096 hartree
zpe.sumelectthermal: -995.478754 hartree
zpe.sumelectthermalent: -995.477809 hartree
zpe.sumelectthermalfe: -995.551819 hartree
dipole: 2.5559 0.5055 -3.0251
dipole: 3.9924
quadrupole: -93.1300 -131.6335 -131.3603
quadrupole: -5.7796 -5.3506 -0.3152
quadrupole: 25.5779 -12.9255 -12.6524 -5.7796 -5.3506 -0.3152
hfenergy: -995.8712043 hartree
pointgroup: C01 [X(C19H22N2O2)]
dipole: -0.8215146 -0.5195641 -1.2338578 debye
polarizability: 257.1200923|45.7656165|234.0639152|-5.5051542|11.717695|210.5020481 unknown
InChI: InChI=1S/C19H22N2O2/c1-21(2)17-12-9-13-5-3-4-6-16(13)18(17)23-19(22)14-7-10-15(20)11-8-14/h3-8,10-11,17-18H,9,12,20H2,1-2H3
charge 0 multiplicity 1
45 atoms
O  0.234396 -0.146389 -0.018413
O  -0.485059 -0.539166 2.17512
N  2.791741 -1.511761 -0.402447
N  -5.413884 -2.859156 -1.384235
C  2.662185 -0.028893 -0.384843
C  1.508449 0.469114 0.510383
C  2.457461 0.565648 -1.799993
C  2.599666 2.102858 -1.762068
C  1.356044 1.982811 0.478773
C  1.836729 2.75419 -0.614337
C  0.69283 2.622934 1.557453
C  1.630839 4.156477 -0.60294
C  2.699344 -2.146036 0.93276
C  4.022386 -1.956752 -1.093024
C  0.49471 4.018484 1.557143
C  0.965431 4.789722 0.467603
C  -0.687219 -0.612679 0.929615
C  -1.893541 -1.187552 0.296429
C  -2.944794 -1.654189 1.132238
C  -2.040926 -1.294515 -1.113582
C  -4.110269 -2.206548 0.584037
C  -3.202096 -1.84721 -1.672946
C  -4.259973 -2.312488 -0.832995
H  3.593134 0.432201 0.055698
H  1.612899 0.132039 1.555263
H  1.450885 0.272073 -2.147638
H  3.190849 0.156514 -2.515158
H  2.269129 2.537515 -2.724935
H  3.674656 2.364512 -1.661156
H  0.324651 2.01069 2.389088
H  1.998416 4.756366 -1.445432
H  1.707767 -1.98515 1.383726
H  3.476079 -1.782584 1.654154
H  2.833073 -3.235844 0.814795
H  4.058139 -3.06036 -1.091063
H  4.959861 -1.5804 -0.606129
H  4.029127 -1.628859 -2.145044
H  -0.020615 4.501369 2.394632
H  0.814404 5.875239 0.45436
H  -2.821813 -1.570823 2.217334
H  -1.230546 -0.942238 -1.757511
H  -4.913819 -2.559896 1.241569
H  -3.302467 -1.926202 -2.762338
H  -5.525723 -2.934908 -2.391263
H  -6.168837 -3.190958 -0.790682
