program: Orca
programVersion: 5.0.2
elementType: F F F O O O O N N N C C C C C C C C C C C C C H H H H H H H H H H H H H H H H
charge: 0
multiplicity: 1
keywords: wb97x-d3
keywords: def2-TZVPP
keywords: def2/J RIJCOSX
keywords: DEFGRID2
keywords: scfconv7
keywords: smallprint printgap noloewdin
keywords: NOSOSCF
formula: C13H16F3N3O4
InChI: InChI=1/C13H16F3N3O4/c1-3-5-17(6-4-2)12-10(18(20)21)7-9(13(14,15)16)8-11(12)19(22)23/h7-8H,3-6H2,1-2H3
39 atoms
F  -4.326858 0.010722 1.249216
F  -4.340446 -1.093856 -0.593684
F  -4.303532 1.057479 -0.625272
O  -0.048028 -3.483928 -0.227022
O  -0.018383 3.327272 0.548151
O  1.164954 -2.560181 1.269763
O  1.178733 2.587381 -1.058313
N  1.88911 -0.079731 -0.072273
N  0.347799 -2.519599 0.382704
N  0.368052 2.442353 -0.177089
C  2.59741 -1.104632 -0.835118
C  2.702778 0.836784 0.722406
C  0.533454 -0.057648 0.000705
C  3.590324 -0.532816 -1.84229
C  3.676416 0.121638 1.654785
C  -0.25713 -1.228625 0.083297
C  -0.238252 1.128025 -0.006079
C  -2.330973 -0.040397 0.0064
C  -1.6369 -1.236973 0.030138
C  -1.617882 1.144783 0.034214
C  2.940155 0.203273 -3.001361
C  4.378053 1.125465 2.556907
C  -3.826021 -0.01822 0.007421
H  1.870324 -1.688419 -1.402005
H  3.119679 -1.795276 -0.1692
H  2.043002 1.434736 1.351918
H  3.255395 1.52935 0.081779
H  4.155835 -1.386209 -2.225633
H  4.323308 0.106732 -1.344313
H  4.424561 -0.429979 1.081429
H  3.134559 -0.609482 2.259241
H  -2.16188 -2.182382 0.0732
H  -2.132247 2.096735 0.021544
H  2.397018 1.088993 -2.677359
H  3.689873 0.528125 -3.724021
H  2.234402 -0.441302 -3.529538
H  5.107711 0.630695 3.198448
H  4.912108 1.880436 1.976425
H  3.669969 1.645951 3.204549
elementType: F O N C H
totalener: -1269.67604856 hartree
nucrepener: 2148.93960494 hartree
electener: -3418.61565350 hartree
oneelecener: -6010.05332977 hartree
twoeener: 2591.43767627 hartree
cpcmener: -0.02243052 hartree
kineticenergy: 1264.88519106 hartree
xcener: -113.617626870889 hartree
chargesum: 0.0000000
charge: -0.177035 -0.176431 -0.178008 -0.367798 -0.365538 -0.358900 -0.352871 -0.062608 0.537212 0.536020 -0.119522 -0.104483 0.047439 -0.109860 -0.080891 -0.036536 0.000920 -0.053399 -0.061098 -0.064743 -0.280055 -0.284256 0.543361 0.115619 0.119236 0.108904 0.112535 0.079984 0.069752 0.069233 0.071874 0.149496 0.144432 0.090588 0.094934 0.081138 0.093787 0.082732 0.084839
qa: -0.1770 -0.1764 -0.1780 -0.3678 -0.3655 -0.3589 -0.3529 -0.0626 0.5372 0.5360 -0.1195 -0.1045 0.0474 -0.1099 -0.0809 -0.0365 0.0009 -0.0534 -0.0611 -0.0647 -0.2801 -0.2843 0.5434 0.1156 0.1192 0.1089 0.1125 0.0800 0.0698 0.0692 0.0719 0.1495 0.1444 0.0906 0.0949 0.0811 0.0938 0.0827 0.0848
va: 1.1156 1.1273 1.1263 1.8708 1.8750 1.8770 1.8697 3.0836 4.1049 4.1024 3.8913 3.8795 4.2418 3.8897 3.8541 3.9162 3.9003 3.8434 4.0894 4.0880 3.9297 3.9543 4.4398 0.9919 0.9922 0.9913 0.9845 1.0081 1.0070 1.0093 1.0183 1.0263 1.0303 1.0086 1.0054 1.0029 1.0035 1.0014 1.0008
dispcorr: -0.021467811 hartree
energy: -1269.697516369769
dipole: 53.49121 -52.44594 1.04527 2.21610 -2.30909 -0.09299 -1.80568 1.67012 -0.13556
magnitude: 1.05812 au
magnitude: 2.68952 debye
