program: Orca
programVersion: 5.0.2
elementType: F F F O O O O N N N C C C C C C C C C C C C C H H H H H H H H H H H H H H H H
charge: 0
multiplicity: 1
keywords: wb97x-d3
keywords: def2-TZVPP
keywords: def2/J RIJCOSX
keywords: DEFGRID2
keywords: scfconv7
keywords: smallprint printgap noloewdin
keywords: NOSOSCF
formula: C13H16F3N3O4
InChI: InChI=1/C13H16F3N3O4/c1-3-5-17(6-4-2)12-10(18(20)21)7-9(13(14,15)16)8-11(12)19(22)23/h7-8H,3-6H2,1-2H3
39 atoms
F  -4.177143 1.000924 -0.629274
F  -4.102273 0.052393 1.293415
F  -4.155405 -1.146444 -0.490455
O  0.225775 -3.337985 -0.562265
O  0.048736 3.431621 0.531777
O  1.3632 -2.58635 1.081026
O  1.253436 2.710703 -1.077977
N  2.074035 0.103727 0.030339
N  0.580967 -2.447384 0.172636
N  0.460858 2.549714 -0.182897
C  2.917309 -0.799308 -0.756035
C  2.804381 1.105739 0.806081
C  0.717716 0.055946 0.016575
C  2.433431 -1.105293 -2.169079
C  3.742058 0.506136 1.850123
C  -0.037671 -1.140839 -0.003841
C  -0.098806 1.215708 0.005228
C  -2.152952 -0.014274 -0.011472
C  -1.419276 -1.183666 -0.063889
C  -1.476152 1.19169 0.048079
C  2.336181 0.110596 -3.074967
C  3.023455 -0.143225 3.02051
C  -3.647346 -0.030873 0.036058
H  3.140249 -1.725925 -0.221704
H  3.875637 -0.285648 -0.853505
H  2.104332 1.737566 1.352183
H  3.375371 1.746366 0.129137
H  1.483847 -1.642933 -2.184955
H  3.16473 -1.807045 -2.577877
H  4.355414 1.334162 2.215467
H  4.438914 -0.197315 1.388555
H  -1.9142 -2.145777 -0.084097
H  -2.019273 2.12758 0.059803
H  2.163476 -0.198202 -4.106688
H  1.514699 0.76861 -2.796489
H  3.256482 0.697387 -3.05652
H  2.366692 0.569688 3.523396
H  2.415326 -0.991228 2.711433
H  3.737497 -0.508064 3.760188
elementType: F O N C H
totalener: -1269.67318553 hartree
nucrepener: 2181.66991796 hartree
electener: -3451.34310349 hartree
oneelecener: -6075.57459247 hartree
twoeener: 2624.23148898 hartree
cpcmener: -0.02186255 hartree
kineticenergy: 1264.88174315 hartree
xcener: -113.617851563815 hartree
chargesum: -0.0000000
charge: -0.178792 -0.177266 -0.175616 -0.362296 -0.366266 -0.358359 -0.350562 0.004278 0.547860 0.534678 -0.131998 -0.080803 -0.033059 -0.091452 -0.112567 -0.067265 -0.019311 -0.052834 -0.043672 -0.054788 -0.275461 -0.280760 0.543286 0.127687 0.101070 0.110380 0.112334 0.075398 0.080937 0.080044 0.070573 0.146676 0.144351 0.098463 0.084885 0.082943 0.080864 0.090842 0.095578
qa: -0.1788 -0.1773 -0.1756 -0.3623 -0.3663 -0.3584 -0.3506 0.0043 0.5479 0.5347 -0.1320 -0.0808 -0.0331 -0.0915 -0.1126 -0.0673 -0.0193 -0.0528 -0.0437 -0.0548 -0.2755 -0.2808 0.5433 0.1277 0.1011 0.1104 0.1123 0.0754 0.0809 0.0800 0.0706 0.1467 0.1444 0.0985 0.0849 0.0829 0.0809 0.0908 0.0956
va: 1.1253 1.1151 1.1295 1.8734 1.8691 1.8672 1.8831 3.0368 4.1020 4.1227 3.8961 3.8900 4.3125 3.8667 3.8868 3.9252 3.9176 3.8489 4.0465 4.0941 3.9129 3.9211 4.4396 0.9947 0.9948 0.9931 1.0013 1.0173 1.0143 1.0085 1.0075 1.0278 1.0304 1.0054 1.0113 1.0032 1.0037 1.0100 1.0046
dispcorr: -0.022944093 hartree
energy: -1269.696129621288
dipole: 46.67938 -45.59389 1.08549 -0.44555 0.45950 0.01395 -0.81415 0.74963 -0.06452
magnitude: 1.08749 au
magnitude: 2.76419 debye
