program: Orca
programVersion: 5.0.2
elementType: F F F O O O O N N N C C C C C C C C C C C C C H H H H H H H H H H H H H H H H
charge: 0
multiplicity: 1
keywords: wb97x-d3
keywords: def2-TZVPP
keywords: def2/J RIJCOSX
keywords: DEFGRID2
keywords: scfconv7
keywords: smallprint printgap noloewdin
keywords: NOSOSCF
formula: C13H16F3N3O4
InChI: InChI=1/C13H16F3N3O4/c1-3-5-17(6-4-2)12-10(18(20)21)7-9(13(14,15)16)8-11(12)19(22)23/h7-8H,3-6H2,1-2H3
39 atoms
F  -4.184517 -1.024624 0.97944
F  -4.332706 0.211715 -0.77087
F  -4.073302 1.119699 1.160944
O  -0.145521 -3.438792 -0.634638
O  0.342245 3.263877 0.617633
O  1.340006 -2.714538 0.730185
O  1.234311 2.531867 -1.190501
N  1.955641 -0.130567 -0.27619
N  0.389448 -2.567332 0.005144
N  0.555688 2.405989 -0.203799
C  2.574345 -0.934906 -1.314519
C  2.848128 0.586383 0.624108
C  0.599294 -0.082353 -0.132464
C  3.339204 -0.09501 -2.333703
C  2.369136 0.624007 2.070767
C  -0.208013 -1.233496 -0.062472
C  -0.115038 1.122689 -0.012813
C  -2.223404 0.022933 0.234685
C  -1.58234 -1.192064 0.063317
C  -1.473978 1.187234 0.217764
C  3.958893 -0.97143 -3.412456
C  3.403291 1.281826 2.972274
C  -3.711029 0.081934 0.404175
H  1.800879 -1.48718 -1.852745
H  3.242774 -1.679164 -0.867408
H  3.086142 1.595897 0.270453
H  3.793248 0.036431 0.601488
H  4.123791 0.479223 -1.834348
H  2.65955 0.634266 -2.77749
H  2.168959 -0.397323 2.401723
H  1.429609 1.171972 2.166296
H  -2.137715 -2.119679 0.089203
H  -1.944356 2.153801 0.339525
H  4.654377 -1.697919 -2.989047
H  3.197702 -1.527549 -3.962004
H  4.511741 -0.372678 -4.135148
H  4.350866 0.741419 2.958928
H  3.60167 2.309624 2.665603
H  3.056832 1.310441 4.004414
totalener: -1269.66205562 hartree
nucrepener: 2151.43254488 hartree
electener: -3421.09460049 hartree
oneelecener: -6015.54860442 hartree
twoeener: 2594.45400393 hartree
kineticenergy: 1264.94738380 hartree
xcener: -113.621103668870 hartree
chargesum: 0.0000000
charge: -0.167991 -0.161985 -0.166987 -0.314707 -0.311622 -0.308011 -0.310519 -0.039565 0.488008 0.500923 -0.108897 -0.136789 0.008063 -0.069885 -0.068686 -0.025692 -0.105916 -0.046065 -0.075461 -0.054114 -0.255150 -0.263906 0.536011 0.090573 0.105139 0.110042 0.083566 0.062266 0.073216 0.079841 0.074254 0.143085 0.142744 0.075477 0.077851 0.090158 0.076408 0.083579 0.090745
qa: -0.1680 -0.1620 -0.1670 -0.3147 -0.3116 -0.3080 -0.3105 -0.0396 0.4880 0.5009 -0.1089 -0.1368 0.0081 -0.0699 -0.0687 -0.0257 -0.1059 -0.0461 -0.0755 -0.0541 -0.2552 -0.2639 0.5360 0.0906 0.1051 0.1100 0.0836 0.0623 0.0732 0.0798 0.0743 0.1431 0.1427 0.0755 0.0779 0.0902 0.0764 0.0836 0.0907
va: 1.1397 1.1369 1.1399 1.9120 1.9172 1.9172 1.9069 3.0083 4.1516 4.1472 3.8957 3.9101 4.1980 3.8449 3.8559 3.9758 3.9957 3.8903 4.1005 4.0821 3.9530 3.9647 4.4475 0.9975 0.9966 0.9881 0.9973 1.0121 1.0222 1.0145 1.0108 1.0337 1.0307 1.0041 1.0034 1.0055 1.0032 1.0031 1.0054
dispcorr: -0.021464799 hartree
energy: -1269.683520413959
dipole: 50.55797 -49.86894 0.68903 0.71741 -0.67525 0.04216 -4.04070 4.02996 -0.01074
magnitude: 0.69040 au
magnitude: 1.75485 debye
