program: Orca
programVersion: 5.0.2
elementType: S F F F F F O O N N C C C C C C C C C C C C C C C C H H H H H H H H H H H H H H H H H
charge: 0
multiplicity: 1
keywords: wb97x-d3
keywords: def2-TZVPP
keywords: def2/J RIJCOSX
keywords: DEFGRID2
keywords: scfconv7
keywords: smallprint printgap noloewdin
keywords: NOSOSCF
formula: C16H17F5N2O2S
InChI: InChI=1/C16H17F5N2O2S/c1-7(2)6-8-9(15(24)25-3)11(13(17)18)23-12(16(19,20)21)10(8)14-22-4-5-26-14/h7,13H,4-6H2,1-3H3
43 atoms
S  2.93205 -0.95761 1.653596
F  2.38782 2.362127 -1.400877
F  1.526523 3.695519 0.043497
F  2.869154 2.151841 0.687731
F  -3.717668 1.597526 1.060051
F  -3.403417 2.113033 -1.042766
O  -3.561704 -0.774016 -0.53524
O  -2.970488 -1.456303 1.510759
N  -0.46792 2.074235 0.025536
N  2.914699 -0.68394 -0.950274
C  -0.143651 -2.194025 0.340749
C  -0.716863 -2.958965 -0.864671
C  -0.252191 -0.696761 0.243667
C  0.881492 0.112341 0.101631
C  -1.496211 -0.055683 0.272515
C  0.709735 1.489566 -0.000587
C  -0.662852 -4.453204 -0.574453
C  0.024631 -2.629587 -2.151647
C  2.237513 -0.486051 0.097966
C  -1.548719 1.328296 0.160289
C  4.522455 -1.244488 0.817009
C  4.167656 -1.360087 -0.669017
C  1.881912 2.433761 -0.166048
C  -2.751928 -0.842299 0.497438
C  -2.822574 2.131086 0.185372
C  -4.835266 -1.423335 -0.423172
H  0.900032 -2.487155 0.457632
H  -0.648882 -2.523405 1.250485
H  -1.767072 -2.688649 -1.00392
H  -1.072919 -5.026005 -1.40741
H  -1.235788 -4.709668 0.318052
H  0.36565 -4.78668 -0.418697
H  -0.010939 -1.565604 -2.390813
H  -0.415671 -3.165906 -2.993382
H  1.073156 -2.926341 -2.086058
H  4.986307 -2.150342 1.20138
H  5.181548 -0.400711 1.016771
H  4.961772 -0.943082 -1.286772
H  4.051271 -2.405984 -0.963425
H  -2.631676 3.165158 0.47016
H  -4.717404 -2.503773 -0.352461
H  -5.373021 -1.175934 -1.332978
H  -5.39031 -1.055508 0.438591
elementType: S F O N C H
totalener: -1777.51596598 hartree
nucrepener: 2821.56599369 hartree
electener: -4599.08195966 hartree
oneelecener: -8059.49465860 hartree
twoeener: 3460.41269893 hartree
cpcmener: -0.03089062 hartree
kineticenergy: 1771.60644703 hartree
xcener: -142.207774075021 hartree
chargesum: 0.0000000
charge: -0.083784 -0.171322 -0.163128 -0.168541 -0.215429 -0.213255 -0.259838 -0.432131 -0.321487 -0.282352 -0.254125 0.087942 -0.009982 0.220506 0.006775 0.111880 -0.309773 -0.304421 -0.062399 0.129479 -0.129096 -0.005767 0.494748 0.372606 0.324733 -0.135722 0.088901 0.129186 0.054769 0.095440 0.094857 0.089059 0.095384 0.102720 0.081489 0.123477 0.113291 0.099739 0.096701 0.120972 0.127652 0.133822 0.126426
qa: -0.0838 -0.1713 -0.1631 -0.1685 -0.2154 -0.2133 -0.2598 -0.4321 -0.3215 -0.2824 -0.2541 0.0879 -0.0100 0.2205 0.0068 0.1119 -0.3098 -0.3044 -0.0624 0.1295 -0.1291 -0.0058 0.4947 0.3726 0.3247 -0.1357 0.0889 0.1292 0.0548 0.0954 0.0949 0.0891 0.0954 0.1027 0.0815 0.1235 0.1133 0.0997 0.0967 0.1210 0.1277 0.1338 0.1264
va: 2.3716 1.1280 1.1479 1.1335 1.0729 1.0639 2.1324 2.0682 3.0656 2.9062 3.8195 3.7773 3.7883 3.3472 3.7534 3.9398 3.9340 3.9332 3.9080 3.9559 3.9512 3.9722 4.5409 4.1924 4.1551 3.8495 1.0408 1.0170 1.0306 1.0038 1.0036 1.0010 1.0034 1.0066 1.0072 1.0102 1.0100 1.0005 1.0056 0.9959 0.9916 0.9940 0.9955
dispcorr: -0.024935654 hartree
energy: -1777.540901631015
dipole: -1.66073 2.30450 0.64377 -46.41356 44.46318 -1.95037 -8.19835 7.91493 -0.28342
magnitude: 2.07334 au
magnitude: 5.27000 debye
