program: Orca
programVersion: 5.0.2
elementType: S F F F F F O O N N C C C C C C C C C C C C C C C C H H H H H H H H H H H H H H H H H
charge: 0
multiplicity: 1
keywords: wb97x-d3
keywords: def2-TZVPP
keywords: def2/J RIJCOSX
keywords: DEFGRID2
keywords: scfconv7
keywords: smallprint printgap noloewdin
keywords: NOSOSCF
formula: C16H17F5N2O2S
InChI: InChI=1/C16H17F5N2O2S/c1-7(2)6-8-9(15(24)25-3)11(13(17)18)23-12(16(19,20)21)10(8)14-22-4-5-26-14/h7,13H,4-6H2,1-3H3
43 atoms
S  2.409738 -0.579926 -2.234333
F  2.548925 2.304604 -0.751212
F  1.419215 3.632838 0.498958
F  2.595527 2.07402 1.389473
F  -3.823174 1.663011 -0.026139
F  -2.739614 3.214411 1.061088
O  -3.198328 -1.242024 -1.042083
O  -3.512005 -1.156747 1.17107
N  -0.533456 1.959585 0.633419
N  2.972926 -0.842278 0.309014
C  -0.223904 -2.193712 -0.392189
C  0.244369 -3.013382 0.826324
C  -0.363749 -0.726357 -0.10437
C  0.770665 0.09823 -0.086933
C  -1.584743 -0.131274 0.215634
C  0.621322 1.427004 0.287739
C  0.583968 -4.426122 0.369673
C  -0.789665 -3.043695 1.941922
C  2.086158 -0.446284 -0.499307
C  -1.613247 1.20932 0.588473
C  4.133771 -1.010053 -1.846662
C  4.112971 -1.423922 -0.371223
C  1.802995 2.370227 0.354996
C  -2.868143 -0.903338 0.183918
C  -2.912548 1.881876 0.967504
C  -4.391365 -2.018079 -1.217773
H  -1.160931 -2.614972 -0.757341
H  0.496408 -2.331439 -1.200946
H  1.155116 -2.554291 1.218818
H  1.35967 -4.422925 -0.398127
H  -0.293274 -4.928348 -0.044464
H  0.946067 -5.029095 1.203615
H  -1.010622 -2.049932 2.33384
H  -0.423892 -3.641902 2.777923
H  -1.725432 -3.492421 1.601433
H  4.759904 -0.135715 -2.017943
H  4.471963 -1.81526 -2.49484
H  4.03669 -2.509214 -0.27121
H  5.035317 -1.124072 0.123961
H  -3.32749 1.514896 1.906604
H  -4.313254 -2.974351 -0.70196
H  -4.477511 -2.187773 -2.286206
H  -5.267452 -1.476903 -0.863365
elementType: S F O N C H
totalener: -1777.51438965 hartree
nucrepener: 2818.73017963 hartree
electener: -4596.24456928 hartree
oneelecener: -8053.68581039 hartree
twoeener: 3457.44124111 hartree
cpcmener: -0.03332579 hartree
kineticenergy: 1771.61723655 hartree
xcener: -142.211720047764 hartree
chargesum: -0.0000000
charge: -0.081602 -0.169087 -0.163789 -0.172404 -0.211946 -0.201739 -0.256808 -0.432822 -0.317071 -0.290319 -0.165307 0.067635 -0.023744 0.171979 0.048373 0.101532 -0.302000 -0.312127 -0.082304 0.192749 -0.127124 -0.007387 0.500455 0.332217 0.275356 -0.134956 0.116658 0.095229 0.047513 0.092727 0.088379 0.094436 0.094358 0.103580 0.084074 0.113285 0.123515 0.096387 0.100583 0.124752 0.124810 0.133752 0.128205
qa: -0.0816 -0.1691 -0.1638 -0.1724 -0.2119 -0.2017 -0.2568 -0.4328 -0.3171 -0.2903 -0.1653 0.0676 -0.0237 0.1720 0.0484 0.1015 -0.3020 -0.3121 -0.0823 0.1927 -0.1271 -0.0074 0.5005 0.3322 0.2754 -0.1350 0.1167 0.0952 0.0475 0.0927 0.0884 0.0944 0.0944 0.1036 0.0841 0.1133 0.1235 0.0964 0.1006 0.1248 0.1248 0.1338 0.1282
va: 2.3805 1.1331 1.1480 1.1273 1.0527 1.0819 2.1542 2.0531 3.0699 2.8881 3.7909 3.7245 3.8207 3.4218 3.6608 3.9485 3.9270 3.9351 3.9182 3.7776 3.9478 3.9739 4.5342 4.1633 4.1989 3.8492 1.0197 1.0461 1.0477 1.0041 1.0012 1.0050 1.0050 1.0057 1.0068 1.0098 1.0103 1.0049 1.0010 0.9870 0.9915 0.9945 0.9938
dispcorr: -0.024984570 hartree
energy: -1777.539374219249
dipole: 0.09877 0.57766 0.67642 -51.52014 48.33799 -3.18215 -1.80919 0.32938 -1.47981
magnitude: 3.57400 au
magnitude: 9.08438 debye
