program: Orca
programVersion: 5.0.2
elementType: S F F F F F O O N N C C C C C C C C C C C C C C C C H H H H H H H H H H H H H H H H H
charge: 0
multiplicity: 1
keywords: wb97x-d3
keywords: def2-TZVPP
keywords: def2/J RIJCOSX
keywords: DEFGRID2
keywords: scfconv7
keywords: smallprint printgap noloewdin
keywords: NOSOSCF
formula: C16H17F5N2O2S
InChI: InChI=1/C16H17F5N2O2S/c1-7(2)6-8-9(15(24)25-3)11(13(17)18)23-12(16(19,20)21)10(8)14-22-4-5-26-14/h7,13H,4-6H2,1-3H3
43 atoms
S  2.8964 -0.883115 1.736396
F  1.547431 3.688073 -0.090999
F  2.898148 2.14503 0.535103
F  2.339968 2.313934 -1.537842
F  -3.723341 1.629933 0.974588
F  -3.406688 2.077151 -1.141254
O  -3.544078 -0.807667 -0.55317
O  -2.999302 -1.386376 1.537708
N  -0.469657 2.078382 -0.069054
N  2.925104 -0.72501 -0.877161
C  -0.156674 -2.1727 0.428193
C  -0.699604 -2.976015 -0.766701
C  -0.260729 -0.681014 0.274762
C  0.875392 0.119066 0.106104
C  -1.503059 -0.037436 0.265835
C  0.706891 1.489664 -0.06372
C  -0.644501 -4.459919 -0.429726
C  0.068262 -2.681642 -2.046826
C  2.22895 -0.481112 0.148468
C  -1.552254 1.340455 0.095141
C  4.502064 -1.194665 0.94106
C  4.171903 -1.384874 -0.543108
C  1.881938 2.418058 -0.286513
C  -2.759488 -0.819381 0.50201
C  -2.828846 2.140256 0.086572
C  -4.797879 -1.494098 -0.452098
H  0.883077 -2.462884 0.581338
H  -0.685938 -2.472276 1.334342
H  -1.747534 -2.715108 -0.936882
H  -1.230088 -4.690346 0.461674
H  0.38291 -4.783114 -0.247728
H  -1.039371 -5.060673 -1.250151
H  -0.352334 -3.244435 -2.881325
H  1.11617 -2.971403 -1.95039
H  0.034006 -1.62547 -2.318464
H  4.968202 -2.076315 1.375253
H  5.149608 -0.335459 1.110253
H  4.977019 -0.999498 -1.166924
H  4.060651 -2.4444 -0.786101
H  -2.64352 3.184677 0.335635
H  -4.64781 -2.558278 -0.275073
H  -5.289515 -1.351882 -1.409168
H  -5.414597 -1.071608 0.340077
elementType: S F O N C H
totalener: -1777.51613959 hartree
nucrepener: 2823.34894246 hartree
electener: -4600.86508205 hartree
oneelecener: -8063.03471733 hartree
twoeener: 3462.16963528 hartree
cpcmener: -0.03102744 hartree
kineticenergy: 1771.61595052 hartree
xcener: -142.209963476346 hartree
chargesum: 0.0000000
charge: -0.085082 -0.163269 -0.168207 -0.171503 -0.214718 -0.213015 -0.259069 -0.431925 -0.322504 -0.280427 -0.250937 0.090143 -0.015770 0.215879 0.008106 0.115246 -0.310166 -0.305621 -0.059907 0.131399 -0.129049 -0.004777 0.492136 0.373233 0.324069 -0.136463 0.088251 0.129376 0.053673 0.094710 0.088980 0.095711 0.103175 0.081740 0.095341 0.123696 0.113127 0.099632 0.096333 0.120575 0.125790 0.133614 0.128472
qa: -0.0851 -0.1633 -0.1682 -0.1715 -0.2147 -0.2130 -0.2591 -0.4319 -0.3225 -0.2804 -0.2509 0.0901 -0.0158 0.2159 0.0081 0.1152 -0.3102 -0.3056 -0.0599 0.1314 -0.1290 -0.0048 0.4921 0.3732 0.3241 -0.1365 0.0883 0.1294 0.0537 0.0947 0.0890 0.0957 0.1032 0.0817 0.0953 0.1237 0.1131 0.0996 0.0963 0.1206 0.1258 0.1336 0.1285
va: 2.3721 1.1479 1.1333 1.1271 1.0734 1.0638 2.1324 2.0690 3.0709 2.9079 3.8213 3.7749 3.7988 3.3498 3.7517 3.9343 3.9337 3.9345 3.9112 3.9552 3.9518 3.9723 4.5409 4.1930 4.1567 3.8491 1.0416 1.0172 1.0308 1.0035 1.0011 1.0038 1.0065 1.0075 1.0034 1.0102 1.0104 1.0005 1.0058 0.9957 0.9924 0.9942 0.9947
dispcorr: -0.024992439 hartree
energy: -1777.541132029162
dipole: -1.38728 2.04967 0.66239 -46.67874 44.70159 -1.97715 -6.24092 6.05172 -0.18920
magnitude: 2.09373 au
magnitude: 5.32183 debye
