program: Orca
programVersion: 5.0.2
elementType: S F F F F F O O N N C C C C C C C C C C C C C C C C H H H H H H H H H H H H H H H H H
charge: 0
multiplicity: 1
keywords: wb97x-d3
keywords: def2-TZVPP
keywords: def2/J RIJCOSX
keywords: DEFGRID2
keywords: scfconv7
keywords: smallprint printgap noloewdin
keywords: NOSOSCF
formula: C16H17F5N2O2S
InChI: InChI=1/C16H17F5N2O2S/c1-7(2)6-8-9(15(24)25-3)11(13(17)18)23-12(16(19,20)21)10(8)14-22-4-5-26-14/h7,13H,4-6H2,1-3H3
43 atoms
S  2.531193 -0.791872 -2.107315
F  2.76462 2.178586 -0.780162
F  1.541164 3.725158 0.058608
F  2.558951 2.352772 1.357231
F  -3.236742 1.755908 2.035694
F  -3.785952 1.891847 -0.068964
O  -3.265306 -0.867129 -1.164284
O  -3.452906 -1.065473 1.057063
N  -0.442222 2.118533 0.468782
N  2.962616 -0.741822 0.473491
C  -0.298229 -2.073329 -0.448689
C  0.230602 -2.935644 0.712191
C  -0.35745 -0.599676 -0.156013
C  0.81001 0.17924 -0.128579
C  -1.560018 0.049028 0.122102
C  0.700362 1.531586 0.170487
C  0.359099 -4.375402 0.232427
C  -0.654532 -2.85445 1.947342
C  2.125198 -0.437734 -0.423433
C  -1.546814 1.400506 0.450718
C  4.220718 -1.207421 -1.577799
C  4.110882 -1.439216 -0.068474
C  1.90055 2.453717 0.198559
C  -2.862671 -0.692816 0.075695
C  -2.790876 2.161561 0.817965
C  -4.500022 -1.567781 -1.365071
H  -1.282305 -2.449227 -0.73335
H  0.339132 -2.235746 -1.320106
H  1.226732 -2.579731 0.98227
H  1.022808 -4.452756 -0.630378
H  -0.612898 -4.782031 -0.056324
H  0.763046 -5.013941 1.019323
H  -0.745904 -1.83572 2.327411
H  -0.237341 -3.462218 2.751562
H  -1.658434 -3.229775 1.739012
H  4.878546 -0.374527 -1.817981
H  4.568041 -2.092273 -2.104613
H  3.984106 -2.500485 0.155641
H  5.01895 -1.114505 0.4356
H  -2.615099 3.236478 0.840668
H  -4.647866 -1.60185 -2.439672
H  -5.330761 -1.038311 -0.90069
H  -4.442596 -2.582128 -0.972738
elementType: S F O N C H
totalener: -1777.51557872 hartree
nucrepener: 2822.64699018 hartree
electener: -4600.16256889 hartree
oneelecener: -8061.65410046 hartree
twoeener: 3461.49153156 hartree
cpcmener: -0.03352266 hartree
kineticenergy: 1771.62758517 hartree
xcener: -142.211318274506 hartree
chargesum: -0.0000000
charge: -0.077839 -0.168259 -0.164222 -0.171811 -0.212192 -0.213082 -0.257918 -0.430679 -0.320643 -0.297423 -0.201361 0.075657 -0.038321 0.195784 0.060421 0.093034 -0.302185 -0.318011 -0.068324 0.169283 -0.125235 -0.006638 0.486675 0.328158 0.332612 -0.135212 0.109204 0.109615 0.053707 0.092484 0.088171 0.094796 0.096874 0.103730 0.082752 0.114654 0.123307 0.096178 0.101897 0.116920 0.133185 0.126405 0.123852
qa: -0.0778 -0.1683 -0.1642 -0.1718 -0.2122 -0.2131 -0.2579 -0.4307 -0.3206 -0.2974 -0.2014 0.0757 -0.0383 0.1958 0.0604 0.0930 -0.3022 -0.3180 -0.0683 0.1693 -0.1252 -0.0066 0.4867 0.3282 0.3326 -0.1352 0.1092 0.1096 0.0537 0.0925 0.0882 0.0948 0.0969 0.1037 0.0828 0.1147 0.1233 0.0962 0.1019 0.1169 0.1332 0.1264 0.1239
va: 2.3905 1.1326 1.1455 1.1261 1.0699 1.0744 2.1509 2.0479 3.0763 2.8918 3.7838 3.7289 3.8411 3.4215 3.7431 3.9453 3.9246 3.9388 3.9093 3.9186 3.9457 3.9690 4.5371 4.1523 4.1596 3.8537 1.0199 1.0419 1.0449 1.0049 1.0018 1.0047 1.0022 1.0056 1.0085 1.0100 1.0112 1.0049 1.0012 0.9971 0.9944 0.9937 0.9918
dispcorr: -0.025018075 hartree
energy: -1777.540596792567
dipole: 0.06338 0.94631 1.00970 -47.51533 45.37426 -2.14106 -3.00768 0.88412 -2.12355
magnitude: 3.18011 au
magnitude: 8.08321 debye
