program: Orca
programVersion: 5.0.2
elementType: S F F F F F O O N N C C C C C C C C C C C C C C C C H H H H H H H H H H H H H H H H H
charge: 0
multiplicity: 1
keywords: wb97x-d3
keywords: def2-TZVPP
keywords: def2/J RIJCOSX
keywords: DEFGRID2
keywords: scfconv7
keywords: smallprint printgap noloewdin
keywords: NOSOSCF
formula: C16H17F5N2O2S
InChI: InChI=1/C16H17F5N2O2S/c1-7(2)6-8-9(15(24)25-3)11(13(17)18)23-12(16(19,20)21)10(8)14-22-4-5-26-14/h7,13H,4-6H2,1-3H3
43 atoms
S  3.028888 -0.637426 1.600811
F  2.513901 2.602243 0.865183
F  2.739658 1.940619 -1.167636
F  1.438624 3.582715 -0.714466
F  -3.697125 1.532858 1.18179
F  -3.428296 2.143897 -0.900127
O  -3.555766 -0.822524 -0.494189
O  -2.968936 -1.497302 1.55698
N  -0.477149 2.03701 0.021043
N  2.794793 -1.032296 -0.975253
C  -0.152583 -2.229809 0.313414
C  -0.767759 -2.984226 -0.881228
C  -0.263985 -0.733429 0.226731
C  0.86632 0.070268 0.031067
C  -1.502286 -0.088376 0.310779
C  0.694684 1.446949 -0.077725
C  -0.509721 -4.474715 -0.707068
C  -0.237062 -2.494053 -2.220599
C  2.216154 -0.542679 0.034017
C  -1.552097 1.296062 0.215786
C  4.536761 -1.188501 0.74819
C  4.054258 -1.6618 -0.627629
C  1.855873 2.399287 -0.28038
C  -2.751994 -0.880588 0.545113
C  -2.819317 2.102959 0.314417
C  -4.795021 -1.538591 -0.414347
H  0.895001 -2.519036 0.396914
H  -0.629865 -2.571266 1.233591
H  -1.851287 -2.839588 -0.878138
H  0.560993 -4.690932 -0.717084
H  -0.970013 -5.045563 -1.514768
H  -0.916584 -4.845827 0.234801
H  -0.441774 -1.434868 -2.385618
H  -0.705186 -3.044478 -3.037755
H  0.840897 -2.64082 -2.297828
H  5.014682 -1.985706 1.313063
H  5.225957 -0.348461 0.675691
H  4.800861 -1.445202 -1.390115
H  3.895542 -2.742928 -0.635056
H  -2.617082 3.121979 0.642594
H  -4.620324 -2.608411 -0.30661
H  -5.30592 -1.347792 -1.352691
H  -5.406003 -1.179336 0.412601
elementType: S F O N C H
totalener: -1777.51413794 hartree
nucrepener: 2824.30035938 hartree
electener: -4601.81449732 hartree
oneelecener: -8064.94316960 hartree
twoeener: 3463.12867228 hartree
cpcmener: -0.03087301 hartree
kineticenergy: 1771.61891112 hartree
xcener: -142.210267650695 hartree
chargesum: -0.0000000
charge: -0.079645 -0.169141 -0.167083 -0.162900 -0.214426 -0.213077 -0.256308 -0.430401 -0.324470 -0.281894 -0.257286 0.101523 -0.025232 0.214432 -0.008356 0.129542 -0.308664 -0.307449 -0.067391 0.136901 -0.126008 -0.000944 0.489191 0.371648 0.322677 -0.134540 0.091861 0.130206 0.049632 0.089885 0.095137 0.094725 0.094838 0.102139 0.082787 0.122757 0.112204 0.100512 0.096048 0.120863 0.124251 0.133755 0.127700
qa: -0.0796 -0.1691 -0.1671 -0.1629 -0.2144 -0.2131 -0.2563 -0.4304 -0.3245 -0.2819 -0.2573 0.1015 -0.0252 0.2144 -0.0084 0.1295 -0.3087 -0.3074 -0.0674 0.1369 -0.1260 -0.0009 0.4892 0.3716 0.3227 -0.1345 0.0919 0.1302 0.0496 0.0899 0.0951 0.0947 0.0948 0.1021 0.0828 0.1228 0.1122 0.1005 0.0960 0.1209 0.1243 0.1338 0.1277
va: 2.3857 1.1292 1.1374 1.1474 1.0739 1.0631 2.1327 2.0706 3.0713 2.9214 3.8676 3.7758 3.8404 3.3203 3.7583 3.9212 3.9339 3.9250 4.0205 3.9495 3.9550 3.9601 4.5417 4.2088 4.1593 3.8492 1.0232 1.0165 1.0271 1.0016 1.0036 1.0027 1.0012 1.0061 1.0192 1.0101 1.0103 1.0009 1.0070 0.9954 0.9921 0.9941 0.9948
dispcorr: -0.025134350 hartree
energy: -1777.539272292541
dipole: -1.89529 2.58291 0.68762 -46.87210 44.91383 -1.95826 -8.41423 8.10619 -0.30804
magnitude: 2.09822 au
magnitude: 5.33324 debye
