program: Orca
programVersion: 5.0.2
elementType: S F F F F F O O N N C C C C C C C C C C C C C C C C H H H H H H H H H H H H H H H H H
charge: 0
multiplicity: 1
keywords: wb97x-d3
keywords: def2-TZVPP
keywords: def2/J RIJCOSX
keywords: DEFGRID2
keywords: scfconv7
keywords: smallprint printgap noloewdin
keywords: NOSOSCF
formula: C16H17F5N2O2S
InChI: InChI=1/C16H17F5N2O2S/c1-7(2)6-8-9(15(24)25-3)11(13(17)18)23-12(16(19,20)21)10(8)14-22-4-5-26-14/h7,13H,4-6H2,1-3H3
43 atoms
S  3.044313 -0.67412 -1.318144
F  1.516976 3.632975 0.239147
F  2.941919 2.04021 0.39181
F  2.066832 2.5248 -1.516502
F  -3.760473 1.64512 1.113371
F  -3.456821 1.991531 -1.019991
O  -3.556265 -0.911815 -0.302228
O  -3.066737 -1.262396 1.85219
N  -0.513274 2.044591 0.039945
N  2.735094 -0.991469 1.257962
C  -0.172891 -2.179779 0.695764
C  0.110565 -2.982472 -0.586178
C  -0.301612 -0.698237 0.478764
C  0.836659 0.090899 0.238646
C  -1.540625 -0.054223 0.473309
C  0.666047 1.45567 0.0386
C  -1.022078 -2.870526 -1.596764
C  0.368555 -4.436193 -0.212034
C  2.182667 -0.530076 0.22539
C  -1.592299 1.316978 0.239372
C  4.530205 -1.165114 -0.391483
C  3.999128 -1.633871 0.968081
C  1.812378 2.416421 -0.208918
C  -2.800807 -0.811645 0.769343
C  -2.870905 2.11417 0.198667
C  -4.816533 -1.575993 -0.165076
H  0.630178 -2.356448 1.411651
H  -1.075163 -2.578178 1.158495
H  1.020047 -2.593127 -1.05265
H  -1.958948 -3.255567 -1.186745
H  -0.793326 -3.451961 -2.491493
H  -1.191427 -1.842124 -1.919982
H  0.59393 -5.033602 -1.096978
H  -0.502706 -4.881931 0.274307
H  1.214261 -4.52942 0.472205
H  5.190306 -0.303068 -0.298478
H  5.057423 -1.953731 -0.924283
H  3.829501 -2.71506 0.972403
H  4.718415 -1.419173 1.758146
H  -2.683305 3.169681 0.396443
H  -4.685539 -2.613506 0.141226
H  -5.274885 -1.544704 -1.149127
H  -5.45789 -1.061682 0.550212
elementType: S F O N C H
totalener: -1777.52121029 hartree
nucrepener: 2830.15364177 hartree
electener: -4607.67485206 hartree
oneelecener: -8076.45610349 hartree
twoeener: 3468.78125143 hartree
cpcmener: -0.02614540 hartree
kineticenergy: 1771.62544867 hartree
xcener: -142.211556385224 hartree
chargesum: -0.0000000
charge: -0.076242 -0.163091 -0.165130 -0.167126 -0.212583 -0.210779 -0.248394 -0.410273 -0.322832 -0.278360 -0.241850 0.076685 -0.021551 0.159610 0.025066 0.117718 -0.306639 -0.310782 -0.066785 0.150990 -0.119281 -0.000818 0.481464 0.363188 0.325839 -0.140032 0.119179 0.113283 0.043865 0.082775 0.102659 0.097517 0.093748 0.089317 0.093422 0.110606 0.121370 0.092677 0.099372 0.118104 0.124094 0.132491 0.127508
qa: -0.0762 -0.1631 -0.1651 -0.1671 -0.2126 -0.2108 -0.2484 -0.4103 -0.3228 -0.2784 -0.2418 0.0767 -0.0216 0.1596 0.0251 0.1177 -0.3066 -0.3108 -0.0668 0.1510 -0.1193 -0.0008 0.4815 0.3632 0.3258 -0.1400 0.1192 0.1133 0.0439 0.0828 0.1027 0.0975 0.0937 0.0893 0.0934 0.1106 0.1214 0.0927 0.0994 0.1181 0.1241 0.1325 0.1275
va: 2.3769 1.1452 1.1325 1.1293 1.0755 1.0675 2.1361 2.0948 3.0810 2.9873 3.7871 3.7168 3.8210 3.3861 3.7251 3.9131 3.9392 3.9407 4.0841 3.9429 3.9381 3.9573 4.5452 4.1921 4.1588 3.8545 1.0296 1.0267 1.0661 1.0038 1.0065 1.0027 1.0043 1.0018 1.0028 1.0095 1.0110 1.0074 1.0004 0.9960 0.9935 0.9938 0.9950
dispcorr: -0.025305461 hartree
energy: -1777.546515756316
dipole: -0.84319 1.67591 0.83272 -47.67703 45.71510 -1.96193 -1.90243 1.15583 -0.74660
magnitude: 2.25832 au
magnitude: 5.74019 debye
