program: Orca
programVersion: 5.0.2
elementType: S F F F F F O O N N C C C C C C C C C C C C C C C C H H H H H H H H H H H H H H H H H
charge: 0
multiplicity: 1
keywords: wb97x-d3
keywords: def2-TZVPP
keywords: def2/J RIJCOSX
keywords: DEFGRID2
keywords: scfconv7
keywords: smallprint printgap noloewdin
keywords: NOSOSCF
formula: C16H17F5N2O2S
InChI: InChI=1/C16H17F5N2O2S/c1-7(2)6-8-9(15(24)25-3)11(13(17)18)23-12(16(19,20)21)10(8)14-22-4-5-26-14/h7,13H,4-6H2,1-3H3
43 atoms
S  2.936714 -0.981028 1.661961
F  2.335604 2.307785 -1.468034
F  1.531482 3.668467 -0.013749
F  2.886964 2.124655 0.605426
F  -3.725719 1.616244 1.075138
F  -3.410162 2.124408 -1.029067
O  -3.580932 -0.764016 -0.510248
O  -2.996675 -1.465969 1.530271
N  -0.475812 2.058865 0.022246
N  2.8844 -0.690562 -0.937202
C  -0.170203 -2.204402 0.371923
C  -0.682749 -2.944486 -0.876761
C  -0.272349 -0.70765 0.280916
C  0.864212 0.093622 0.125764
C  -1.514268 -0.062211 0.30244
C  0.698477 1.469058 -0.00409
C  -0.664622 -4.443493 -0.607923
C  0.132383 -2.603717 -2.116346
C  2.218482 -0.506619 0.114455
C  -1.559618 1.321026 0.173926
C  4.516574 -1.257938 0.803123
C  4.148322 -1.348972 -0.685221
C  1.872713 2.401636 -0.218059
C  -2.773284 -0.844678 0.524932
C  -2.82725 2.136006 0.197438
C  -4.855719 -1.405944 -0.405024
H  0.865738 -2.501346 0.53906
H  -0.722642 -2.546473 1.248442
H  -1.7202 -2.654415 -1.068118
H  -1.035775 -4.999751 -1.470259
H  -1.289381 -4.705708 0.24779
H  0.348885 -4.7954 -0.400829
H  0.120881 -1.536285 -2.342626
H  -0.266781 -3.12271 -2.989455
H  1.174366 -2.90883 -2.000089
H  4.984225 -2.169805 1.168915
H  5.179867 -0.418808 1.009801
H  4.928452 -0.903612 -1.302464
H  4.047072 -2.390864 -1.001703
H  -2.620473 3.169073 0.478183
H  -4.746433 -2.487447 -0.328324
H  -5.38612 -1.16052 -1.320309
H  -5.418482 -1.033976 0.450597
elementType: S F O N C H
totalener: -1777.52243723 hartree
nucrepener: 2823.22886305 hartree
electener: -4600.75130028 hartree
oneelecener: -8062.75272817 hartree
twoeener: 3462.00142788 hartree
cpcmener: -0.02609712 hartree
kineticenergy: 1771.62560776 hartree
xcener: -142.210315118204 hartree
chargesum: -0.0000000
charge: -0.083131 -0.169561 -0.162083 -0.169099 -0.213909 -0.211069 -0.257021 -0.406934 -0.317392 -0.272942 -0.242928 0.084588 -0.015467 0.218117 0.018224 0.108206 -0.307918 -0.300076 -0.065369 0.125467 -0.132452 -0.007709 0.493699 0.346531 0.325069 -0.136783 0.087616 0.128338 0.052096 0.094484 0.094822 0.087625 0.094684 0.102221 0.080665 0.121447 0.113198 0.098800 0.094756 0.118132 0.125097 0.132334 0.125625
qa: -0.0831 -0.1696 -0.1621 -0.1691 -0.2139 -0.2111 -0.2570 -0.4069 -0.3174 -0.2729 -0.2429 0.0846 -0.0155 0.2181 0.0182 0.1082 -0.3079 -0.3001 -0.0654 0.1255 -0.1325 -0.0077 0.4937 0.3465 0.3251 -0.1368 0.0876 0.1283 0.0521 0.0945 0.0948 0.0876 0.0947 0.1022 0.0807 0.1214 0.1132 0.0988 0.0948 0.1181 0.1251 0.1323 0.1256
va: 2.3693 1.1300 1.1495 1.1329 1.0745 1.0666 2.1294 2.0989 3.0683 2.9047 3.8165 3.7761 3.7966 3.3360 3.7416 3.9462 3.9336 3.9360 3.8985 3.9578 3.9500 3.9726 4.5407 4.2126 4.1571 3.8547 1.0444 1.0192 1.0313 1.0041 1.0037 1.0014 1.0055 1.0062 1.0066 1.0102 1.0095 1.0009 1.0045 0.9961 0.9923 0.9942 0.9956
dispcorr: -0.025032096 hartree
energy: -1777.547469330143
dipole: -1.37279 2.00600 0.63321 -46.08104 44.19923 -1.88181 -8.00632 7.73384 -0.27248
magnitude: 2.00409 au
magnitude: 5.09400 debye
