program: Orca
programVersion: 5.0.2
elementType: S F F F F F O O N N C C C C C C C C C C C C C C C C H H H H H H H H H H H H H H H H H
charge: 0
multiplicity: 1
keywords: wb97x-d3
keywords: def2-TZVPP
keywords: def2/J RIJCOSX
keywords: DEFGRID2
keywords: scfconv7
keywords: smallprint printgap noloewdin
keywords: NOSOSCF
formula: C16H17F5N2O2S
InChI: InChI=1/C16H17F5N2O2S/c1-7(2)6-8-9(15(24)25-3)11(13(17)18)23-12(16(19,20)21)10(8)14-22-4-5-26-14/h7,13H,4-6H2,1-3H3
43 atoms
S  2.508589 -0.726355 -2.132404
F  2.648424 2.115449 1.397256
F  2.661157 2.316713 -0.748592
F  1.525309 3.683289 0.456509
F  -3.286426 1.750219 1.987237
F  -3.800886 1.807355 -0.13361
O  -3.197096 -0.965083 -1.240894
O  -3.491314 -1.108787 0.97114
N  -0.465045 2.067099 0.516836
N  3.013352 -0.692662 0.433956
C  -0.288151 -2.116537 -0.402641
C  -0.473684 -2.956643 0.877559
C  -0.344579 -0.635332 -0.155273
C  0.812255 0.151434 -0.099445
C  -1.563298 0.000365 0.100208
C  0.687435 1.495162 0.244018
C  0.650316 -2.739802 1.880179
C  -0.582155 -4.426975 0.494624
C  2.138708 -0.423666 -0.427973
C  -1.567387 1.346381 0.442603
C  4.209137 -1.179528 -1.669139
C  4.209938 -1.273499 -0.129106
C  1.889753 2.411714 0.338745
C  -2.860069 -0.750918 0.012397
C  -2.823016 2.110914 0.762275
C  -4.402921 -1.698737 -1.48462
H  -1.058272 -2.393802 -1.125091
H  0.661715 -2.392417 -0.862721
H  -1.411707 -2.664791 1.357027
H  0.738528 -1.697411 2.189183
H  1.613378 -3.049593 1.469724
H  0.471891 -3.327986 2.782143
H  -1.423225 -4.606509 -0.177645
H  -0.72812 -5.05049 1.378361
H  0.324853 -4.773479 -0.006953
H  4.889526 -0.411505 -2.032434
H  4.476396 -2.124954 -2.135752
H  4.262611 -2.313563 0.199449
H  5.083449 -0.769274 0.284358
H  -2.649314 3.1874 0.748616
H  -4.502469 -1.752689 -2.564021
H  -5.268516 -1.186446 -1.066457
H  -4.340157 -2.706598 -1.074749
elementType: S F O N C H
totalener: -1777.52073480 hartree
nucrepener: 2821.64019424 hartree
electener: -4599.16092904 hartree
oneelecener: -8059.64227432 hartree
twoeener: 3460.48134528 hartree
cpcmener: -0.02807740 hartree
kineticenergy: 1771.62539373 hartree
xcener: -142.209322899809 hartree
chargesum: 0.0000000
charge: -0.088662 -0.169099 -0.171057 -0.162891 -0.209133 -0.212552 -0.254622 -0.405184 -0.313433 -0.268661 -0.189773 0.069584 -0.033619 0.197587 0.053730 0.117598 -0.298779 -0.307965 -0.085141 0.147467 -0.130927 -0.008538 0.497269 0.292398 0.328851 -0.134432 0.116278 0.093628 0.059458 0.093834 0.078085 0.102513 0.093621 0.093741 0.086785 0.115807 0.118761 0.095094 0.097683 0.114606 0.131626 0.126321 0.122148
qa: -0.0887 -0.1691 -0.1711 -0.1629 -0.2091 -0.2126 -0.2546 -0.4052 -0.3134 -0.2687 -0.1898 0.0696 -0.0336 0.1976 0.0537 0.1176 -0.2988 -0.3080 -0.0851 0.1475 -0.1309 -0.0085 0.4973 0.2924 0.3289 -0.1344 0.1163 0.0936 0.0595 0.0938 0.0781 0.1025 0.0936 0.0937 0.0868 0.1158 0.1188 0.0951 0.0977 0.1146 0.1316 0.1263 0.1221
va: 2.3651 1.1318 1.1310 1.1486 1.0723 1.0746 2.1514 2.0775 3.0654 2.8903 3.7949 3.7586 3.8432 3.3363 3.7772 3.9299 3.9372 3.9307 3.8759 3.9264 3.9363 3.9700 4.5416 4.1882 4.1607 3.8529 1.0198 1.0411 1.0364 1.0078 1.0049 1.0057 1.0038 1.0048 1.0008 1.0091 1.0104 1.0024 1.0019 0.9970 0.9951 0.9944 0.9921
dispcorr: -0.024987568 hartree
energy: -1777.545722365288
dipole: 1.09585 -0.18616 0.90969 -47.01080 44.91983 -2.09097 -3.43687 1.44694 -1.98992
magnitude: 3.02647 au
magnitude: 7.69266 debye
