program: Orca
programVersion: 5.0.2
elementType: S F F F F F O O N N C C C C C C C C C C C C C C C C H H H H H H H H H H H H H H H H H
charge: 0
multiplicity: 1
keywords: wb97x-d3
keywords: def2-TZVPP
keywords: def2/J RIJCOSX
keywords: DEFGRID2
keywords: scfconv7
keywords: smallprint printgap noloewdin
keywords: NOSOSCF
formula: C16H17F5N2O2S
InChI: InChI=1/C16H17F5N2O2S/c1-7(2)6-8-9(15(24)25-3)11(13(17)18)23-12(16(19,20)21)10(8)14-22-4-5-26-14/h7,13H,4-6H2,1-3H3
43 atoms
S  2.460483 -0.545755 -2.258909
F  2.650883 2.050836 1.28496
F  2.480324 2.337868 -0.842751
F  1.41632 3.628676 0.505926
F  -3.812742 1.691422 0.025957
F  -2.723503 3.166761 1.216145
O  -3.214012 -1.263478 -1.03562
O  -3.520541 -1.126472 1.17557
N  -0.52985 1.944993 0.647866
N  2.927325 -0.875158 0.296488
C  -0.222488 -2.181323 -0.477368
C  0.257598 -3.0313 0.715987
C  -0.367225 -0.721531 -0.149355
C  0.76431 0.103726 -0.127898
C  -1.585074 -0.140398 0.203616
C  0.62005 1.427728 0.270598
C  0.626334 -4.424612 0.218989
C  -0.782024 -3.113209 1.825393
C  2.081677 -0.443196 -0.528198
C  -1.606798 1.192076 0.611356
C  4.163737 -0.997586 -1.815926
C  4.084458 -1.450312 -0.347331
C  1.801552 2.378639 0.30989
C  -2.873758 -0.90297 0.190635
C  -2.904239 1.852787 1.029675
C  -4.458227 -1.941929 -1.183961
H  -1.161242 -2.590614 -0.852037
H  0.491908 -2.291016 -1.296418
H  1.158514 -2.565572 1.125284
H  1.406441 -4.386151 -0.543326
H  -0.237459 -4.931756 -0.21709
H  0.992544 -5.047566 1.035699
H  -1.035294 -2.136172 2.236353
H  -0.408692 -3.720528 2.650822
H  -1.706812 -3.575451 1.472938
H  4.800069 -0.121192 -1.936737
H  4.525976 -1.78435 -2.474681
H  3.993656 -2.538885 -0.276359
H  4.987362 -1.171267 0.196362
H  -3.322896 1.42023 1.940736
H  -4.4663 -2.886547 -0.639969
H  -4.566977 -2.130812 -2.247723
H  -5.286433 -1.325979 -0.834948
totalener: -1777.49781229 hartree
nucrepener: 2819.61855167 hartree
electener: -4597.11636396 hartree
oneelecener: -8055.07843078 hartree
twoeener: 3457.96206682 hartree
kineticenergy: 1771.67830622 hartree
xcener: -142.217146764509 hartree
chargesum: 0.0000000
charge: -0.045847 -0.159932 -0.167630 -0.143701 -0.197100 -0.169835 -0.246856 -0.330836 -0.248346 -0.233695 -0.191235 0.035207 -0.035065 0.197638 0.060030 0.054812 -0.267773 -0.278143 -0.109498 0.122000 -0.148443 -0.022838 0.508242 0.254965 0.288476 -0.141494 0.108596 0.089672 0.060013 0.079159 0.079283 0.089359 0.099322 0.095298 0.073640 0.108515 0.106045 0.079051 0.093800 0.095854 0.111313 0.123491 0.124487
qa: -0.0458 -0.1599 -0.1676 -0.1437 -0.1971 -0.1698 -0.2469 -0.3308 -0.2483 -0.2337 -0.1912 0.0352 -0.0351 0.1976 0.0600 0.0548 -0.2678 -0.2781 -0.1095 0.1220 -0.1484 -0.0228 0.5082 0.2550 0.2885 -0.1415 0.1086 0.0897 0.0600 0.0792 0.0793 0.0894 0.0993 0.0953 0.0736 0.1085 0.1060 0.0791 0.0938 0.0959 0.1113 0.1235 0.1245
va: 2.3900 1.1465 1.1348 1.1775 1.0710 1.1265 2.1391 2.1580 3.0887 2.9080 3.7779 3.7580 3.7964 3.3766 3.6079 4.0135 3.9283 3.9474 3.9575 3.8444 3.9635 3.9884 4.5143 4.2314 4.2103 3.8825 1.0276 1.0552 1.0439 1.0083 1.0049 1.0080 1.0088 1.0064 1.0096 1.0056 1.0102 1.0040 1.0016 0.9907 0.9933 0.9945 0.9964
dispcorr: -0.025019733 hartree
energy: -1777.522832025172
dipole: -0.02224 0.49352 0.47128 -51.51199 49.23853 -2.27346 -2.37544 1.41630 -0.95914
magnitude: 2.51210 au
magnitude: 6.38525 debye
