program: Orca
programVersion: 5.0.2
elementType: S F F F F F O O N N C C C C C C C C C C C C C C C C H H H H H H H H H H H H H H H H H
charge: 0
multiplicity: 1
keywords: wb97x-d3
keywords: def2-TZVPP
keywords: def2/J RIJCOSX
keywords: DEFGRID2
keywords: scfconv7
keywords: smallprint printgap noloewdin
keywords: NOSOSCF
formula: C16H17F5N2O2S
InChI: InChI=1/C16H17F5N2O2S/c1-7(2)6-8-9(15(24)25-3)11(13(17)18)23-12(16(19,20)21)10(8)14-22-4-5-26-14/h7,13H,4-6H2,1-3H3
43 atoms
S  3.262765 -0.725158 0.802201
F  2.772856 2.127585 -0.633953
F  1.438238 3.640939 0.091907
F  2.37469 2.296971 1.480722
F  -3.750972 1.266159 1.321534
F  -3.450469 2.459709 -0.482571
O  -3.631178 -0.424299 -1.08952
O  -3.185587 -1.728955 0.671537
N  -0.510958 1.986731 0.427522
N  2.415419 -0.925955 -1.66541
C  -0.310165 -2.141265 -0.720237
C  0.352275 -3.090957 0.295513
C  -0.37911 -0.696501 -0.305371
C  0.78079 0.092701 -0.21788
C  -1.598373 -0.08012 -0.021929
C  0.648953 1.430004 0.144758
C  0.196959 -4.523737 -0.202965
C  -0.202757 -2.938087 1.705792
C  2.101573 -0.504881 -0.521764
C  -1.606896 1.263731 0.340067
C  4.513602 -1.174878 -0.435036
C  3.701879 -1.581834 -1.674933
C  1.822964 2.384543 0.268191
C  -2.885721 -0.848805 -0.083374
C  -2.857615 2.041568 0.658487
C  -4.933893 -0.988029 -1.206539
H  -1.312602 -2.515301 -0.928226
H  0.236072 -2.197465 -1.663302
H  1.421466 -2.8660 0.334585
H  0.597151 -4.648275 -1.210846
H  -0.854366 -4.819063 -0.224008
H  0.720792 -5.223281 0.44929
H  0.287855 -3.639124 2.3819
H  -1.274537 -3.129418 1.740929
H  -0.034122 -1.936643 2.104188
H  5.135161 -1.985309 -0.059233
H  5.146532 -0.308598 -0.628565
H  4.23865 -1.339553 -2.592526
H  3.522793 -2.662834 -1.685226
H  -2.617657 2.911845 1.272039
H  -4.889412 -2.060944 -1.393208
H  -5.397748 -0.488426 -2.051654
H  -5.522842 -0.809707 -0.307248
totalener: -1777.49891444 hartree
nucrepener: 2829.78790859 hartree
electener: -4607.28682302 hartree
oneelecener: -8075.52565806 hartree
twoeener: 3468.23883504 hartree
kineticenergy: 1771.67958687 hartree
xcener: -142.217533586254 hartree
chargesum: -0.0000000
charge: -0.043236 -0.163631 -0.147951 -0.158653 -0.198628 -0.189262 -0.240747 -0.332841 -0.283013 -0.237009 -0.264624 0.056787 -0.038757 0.102387 0.079429 0.091748 -0.283241 -0.279946 -0.038579 0.115512 -0.138907 -0.018637 0.492536 0.299121 0.324944 -0.143243 0.099486 0.125026 0.039680 0.084054 0.086100 0.087922 0.089074 0.104591 0.082077 0.106623 0.107181 0.093826 0.078684 0.098178 0.113819 0.123841 0.118277
qa: -0.0432 -0.1636 -0.1480 -0.1587 -0.1986 -0.1893 -0.2407 -0.3328 -0.2830 -0.2370 -0.2646 0.0568 -0.0388 0.1024 0.0794 0.0917 -0.2832 -0.2799 -0.0386 0.1155 -0.1389 -0.0186 0.4925 0.2991 0.3249 -0.1432 0.0995 0.1250 0.0397 0.0841 0.0861 0.0879 0.0891 0.1046 0.0821 0.1066 0.1072 0.0938 0.0787 0.0982 0.1138 0.1238 0.1183
va: 2.3886 1.1347 1.1681 1.1416 1.0928 1.0964 2.1565 2.1566 3.0852 2.9922 3.8131 3.7824 3.8233 3.4336 3.7251 3.9526 3.9382 3.9535 4.0817 3.9762 3.9576 3.9731 4.5266 4.2662 4.1743 3.8916 1.0149 1.0282 1.0499 1.0039 1.0058 1.0066 1.0061 1.0154 1.0038 1.0122 1.0061 0.9999 1.0066 0.9979 0.9940 0.9946 0.9962
dispcorr: -0.025156814 hartree
energy: -1777.524071252405
dipole: -0.23278 0.76284 0.53006 -46.50921 45.28180 -1.22741 -6.07487 5.43272 -0.64215
magnitude: 1.48319 au
magnitude: 3.76998 debye
