program: Orca
programVersion: 5.0.2
elementType: S F F F F F O O N N C C C C C C C C C C C C C C C C H H H H H H H H H H H H H H H H H
charge: 0
multiplicity: 1
keywords: wb97x-d3
keywords: def2-TZVPP
keywords: def2/J RIJCOSX
keywords: DEFGRID2
keywords: scfconv7
keywords: smallprint printgap noloewdin
keywords: NOSOSCF
formula: C16H17F5N2O2S
InChI: InChI=1/C16H17F5N2O2S/c1-7(2)6-8-9(15(24)25-3)11(13(17)18)23-12(16(19,20)21)10(8)14-22-4-5-26-14/h7,13H,4-6H2,1-3H3
43 atoms
S  2.984931 -0.861431 1.646568
F  2.224362 2.308457 -1.559329
F  1.473728 3.673512 -0.076977
F  2.859576 2.135638 0.492683
F  -3.744823 1.599136 1.116702
F  -3.48209 2.051996 -1.007941
O  -3.621492 -0.791574 -0.425953
O  -2.969012 -1.527267 1.583195
N  -0.528803 2.039067 -0.002391
N  2.818858 -0.753137 -0.964709
C  -0.104085 -2.206225 0.381681
C  0.064132 -2.86629 -1.001235
C  -0.280492 -0.715873 0.303082
C  0.842248 0.10135 0.120649
C  -1.532731 -0.094944 0.330869
C  0.656639 1.469735 -0.033875
C  -1.202391 -2.776321 -1.842078
C  0.487729 -4.31851 -0.813415
C  2.201027 -0.489637 0.098351
C  -1.597752 1.287803 0.174644
C  4.525714 -1.186944 0.740317
C  4.091235 -1.39078 -0.722178
C  1.814756 2.412259 -0.294289
C  -2.778386 -0.888623 0.587486
C  -2.874668 2.091864 0.199295
C  -4.894935 -1.40667 -0.266223
H  0.781167 -2.424649 0.982689
H  -0.938258 -2.670124 0.906632
H  0.863032 -2.344157 -1.535185
H  -1.500945 -1.746718 -2.038757
H  -2.038555 -3.284225 -1.355208
H  -1.050568 -3.254358 -2.810554
H  -0.270925 -4.885681 -0.269441
H  1.421214 -4.394085 -0.253332
H  0.638516 -4.809859 -1.775331
H  5.023611 -2.062565 1.151937
H  5.184824 -0.326493 0.851645
H  4.839215 -0.995665 -1.409781
H  3.977142 -2.454566 -0.952549
H  -2.653865 3.131775 0.44678
H  -5.427563 -0.993173 0.589725
H  -4.803445 -2.485332 -0.139517
H  -5.444365 -1.19025 -1.17729
totalener: -1777.50055526 hartree
nucrepener: 2826.82796945 hartree
electener: -4604.32852471 hartree
oneelecener: -8069.50205119 hartree
twoeener: 3465.17352647 hartree
kineticenergy: 1771.68189588 hartree
xcener: -142.217232054739 hartree
chargesum: -0.0000000
charge: -0.045037 -0.157708 -0.148306 -0.166765 -0.201403 -0.189953 -0.239530 -0.327468 -0.279431 -0.231177 -0.198965 0.037036 -0.024867 0.206115 -0.020579 0.066402 -0.290121 -0.268942 -0.109464 0.127497 -0.149019 -0.021504 0.500066 0.302396 0.327059 -0.142676 0.090232 0.131126 0.060872 0.102817 0.070630 0.095912 0.083532 0.079358 0.087166 0.106971 0.108185 0.092744 0.080208 0.097808 0.122227 0.112429 0.124129
qa: -0.0450 -0.1577 -0.1483 -0.1668 -0.2014 -0.1900 -0.2395 -0.3275 -0.2794 -0.2312 -0.1990 0.0370 -0.0249 0.2061 -0.0206 0.0664 -0.2901 -0.2689 -0.1095 0.1275 -0.1490 -0.0215 0.5001 0.3024 0.3271 -0.1427 0.0902 0.1311 0.0609 0.1028 0.0706 0.0959 0.0835 0.0794 0.0872 0.1070 0.1082 0.0927 0.0802 0.0978 0.1222 0.1124 0.1241
va: 2.3904 1.1478 1.1697 1.1351 1.0899 1.0960 2.1198 2.1728 3.0807 2.9066 3.7590 3.7517 3.7852 3.3704 3.7348 4.0010 3.9544 3.9293 3.9552 3.9616 3.9624 3.9869 4.5253 4.2094 4.1743 3.8841 1.0546 1.0266 1.0445 1.0055 1.0067 1.0075 1.0048 1.0084 1.0077 1.0101 1.0059 1.0016 1.0039 0.9980 0.9974 0.9952 0.9944
dispcorr: -0.025319194 hartree
energy: -1777.525874453950
dipole: -0.89920 1.46830 0.56910 -46.01267 44.64479 -1.36788 -7.45774 7.21308 -0.24466
magnitude: 1.50161 au
magnitude: 3.81678 debye
