program: Orca
programVersion: 5.0.2
elementType: Cl Cl O N C C C C C C C C C C C C H H H H H H H H H H H
charge: 0
multiplicity: 1
keywords: wb97x-d3
keywords: def2-TZVPP
keywords: def2/J RIJCOSX
keywords: DEFGRID2
keywords: scfconv7
keywords: smallprint printgap noloewdin
keywords: NOSOSCF
formula: C12H11Cl2NO
InChI: InChI=1/C12H11Cl2NO/c1-4-12(2,3)15-11(16)8-5-9(13)7-10(14)6-8/h1,5-7,15H,2-3H3
27 atoms
Cl -3.825267 -2.06782 -0.438293
Cl -2.378138 3.060411 0.18974
O  1.306146 -1.893737 0.96395
N  2.063619 -0.027678 -0.084285
C  3.50814 -0.291998 -0.013789
C  3.890007 -1.548461 -0.805354
C  3.998214 -0.388453 1.434996
C  1.10395 -0.823037 0.40247
C  -0.300352 -0.334579 0.208575
C  4.159009 0.862508 -0.644639
C  -0.631159 1.014693 0.259858
C  -1.288317 -1.292998 0.010771
C  -2.598052 -0.883484 -0.159895
C  -1.95661 1.386825 0.105126
C  -2.956986 0.454261 -0.110646
C  4.701446 1.800681 -1.161767
H  1.78063 0.793028 -0.59796
H  3.447505 -2.44009 -0.366118
H  3.563907 -1.470532 -1.841741
H  4.972601 -1.672006 -0.796203
H  5.081561 -0.505174 1.445448
H  3.746113 0.512161 1.993496
H  3.565245 -1.247894 1.942323
H  0.118742 1.77187 0.445783
H  -1.035208 -2.343692 -0.024599
H  -3.986742 0.760024 -0.233993
H  5.191731 2.63075 -1.620125
elementType: Cl O N C H
totalener: -1514.30970498 hartree
nucrepener: 1219.08518616 hartree
electener: -2733.39489114 hartree
oneelecener: -4497.96064946 hartree
twoeener: 1764.56575831 hartree
cpcmener: -0.02693918 hartree
kineticenergy: 1510.35915272 hartree
xcener: -100.373857563235 hartree
chargesum: 0.0000000
charge: -0.076574 -0.075589 -0.553382 -0.169350 0.102862 -0.292771 -0.292510 0.483436 -0.001023 -0.584212 -0.189047 -0.163420 0.067100 0.076254 -0.119587 0.280556 0.177881 0.103557 0.108738 0.108305 0.110009 0.109279 0.106284 0.131876 0.129427 0.132304 0.289596
qa: -0.0766 -0.0756 -0.5534 -0.1693 0.1029 -0.2928 -0.2925 0.4834 -0.0010 -0.5842 -0.1890 -0.1634 0.0671 0.0763 -0.1196 0.2806 0.1779 0.1036 0.1087 0.1083 0.1100 0.1093 0.1063 0.1319 0.1294 0.1323 0.2896
va: 1.2257 1.2274 1.9428 3.3042 4.0648 3.8804 3.8766 4.0053 3.6981 3.8515 4.0665 4.0624 3.9348 3.9197 4.0203 3.2960 1.0061 1.0211 1.0094 1.0043 1.0038 1.0086 1.0203 1.0307 1.0378 1.0149 0.9445
dispcorr: -0.012114084 hartree
energy: -1514.321819064888
dipole: 33.28132 -32.36733 0.91399 -4.39550 5.85853 1.46303 0.66985 -1.55460 -0.88475
magnitude: 1.93872 au
magnitude: 4.92783 debye
