program: Gaussian 09
title: 000059238
version: EM64L-G09RevD.01
frameworkgroup: C1[X(C14H20N2)]
method: RPBEPBE
basis: SDD
operation: Freq
keyword: #pfreq=noraman
keyword: PBEPBE/SDD
title: #p freq=noraman PBEPBE/SDD
converged: YES YES NO NO
title: Mulliken charges:
elementType: N N C C C C C C C C C C C C C C H H H H H H H H H H H H H H H H H H H H
charge: -0.373823 -0.105187 -0.367347 -0.559771 -0.583403 -0.024874 0.167303 -0.409329 0.388448 0.047573 -0.683971 -0.711807 -0.433048 -0.360259 -0.257064 -0.229767 0.208600 0.222109 0.261106 0.207031 0.234227 0.215510 0.197665 0.208839 0.259883 0.291641 0.225748 0.214240 0.204371 0.199829 0.210898 0.223588 0.225614 0.243621 0.220368 0.221441
chargesum: 0.00000
title: Mulliken charges with hydrogens summed into heavy atoms:
elementType: N N C C C C C C C C C C C C C C
charge: -0.082181 -0.105187 0.063361 -0.091634 -0.133666 0.172792 0.167303 0.059392 0.388448 0.047573 -0.039612 -0.077493 -0.207434 -0.116639 -0.036696 -0.008326
polarizability: 2.36130416e+02 1.87892852e+01 1.68113838e+02 -5.07660415e+00 -3.59388151e+00 1.06343743e+02
1716.lowfreq: -23.9697 -8.7565 -7.1528 -0.0009 -0.0008 -0.0007 15.4330 41.5506 56.1489
frequency: 15.4009 41.4761 56.0315 96.7849 100.5784 130.9570 171.6353 186.5166 196.6645 243.0211 273.5310 313.9633 329.8249 350.3984 366.6558 373.0168 402.6480 430.0095 477.0993 486.6077 512.2091 544.4247 589.9224 595.9074 619.2378 673.2706 733.7376 737.8137 764.8260 768.4310 780.7097 837.9536 855.1321 869.2858 876.5054 911.8279 939.5401 940.5001 950.7734 966.0276 975.2486 986.7307 1002.0616 1032.7646 1049.4025 1071.0263 1101.1735 1119.5948 1141.6328 1160.6221 1164.1360 1169.3443 1191.2062 1197.5220 1219.3298 1242.0683 1264.1002 1281.1990 1301.5862 1306.9055 1322.6229 1331.2166 1339.6685 1348.1204 1365.5456 1371.7311 1376.4037 1395.3970 1439.0537 1451.6425 1458.0530 1461.3743 1465.2028 1469.7935 1471.7151 1476.4235 1482.2652 1488.6608 1509.7423 1569.2102 1597.4371 1620.2714 2960.9277 2964.0549 2968.3710 2974.7292 2978.2473 2978.9920 2991.5729 3030.4078 3045.3123 3054.5600 3056.3223 3067.0203 3070.4307 3072.8091 3082.1323 3108.0819 3124.5490 3145.1465 3160.3378 3579.9646
redmass: 3.3227 3.8691 2.6297 3.6875 3.4434 3.2395 2.0057 1.4583 2.2546 1.1039 2.8334 3.2053 3.6983 2.1307 2.1878 4.4386 2.8104 2.5748 3.0561 1.3268 2.9381 3.4461 3.8314 2.6096 4.0773 4.9547 2.0511 2.0448 3.0669 1.7592 3.1674 2.5518 2.2159 1.6194 2.3507 1.2669 1.4757 1.4846 1.8378 1.9077 1.3093 2.8088 2.0619 2.1415 1.9407 2.3066 1.8272 1.7619 1.9911 1.1583 1.3999 1.1212 1.9642 2.2469 2.3402 1.2881 1.2469 1.4132 1.5307 1.4032 1.6249 1.5062 1.5141 1.3781 1.4046 4.8699 1.2306 1.2266 2.2210 1.0985 1.0984 1.0530 1.6023 1.1654 1.0548 1.4810 1.0556 1.0856 1.9092 6.4050 6.9159 6.9278 1.0712 1.0387 1.0632 1.0645 1.0574 1.0495 1.0614 1.0992 1.0994 1.0991 1.1037 1.0986 1.0967 1.0990 1.0994 1.0876 1.0875 1.0934 1.1001 1.0769
irintensity: 0.7525 1.2787 0.2362 1.1697 1.6707 2.5694 0.8075 0.0113 1.4140 1.0295 1.1002 5.2059 4.9633 0.2859 1.9707 2.0885 3.4038 10.4751 6.0564 87.1044 5.3671 2.1624 5.3868 13.1532 0.7244 13.5996 21.7100 3.6226 14.7040 53.0251 5.2515 9.6428 9.3337 1.4740 0.6418 0.7934 3.0378 2.5110 3.3118 0.7746 0.1234 0.5702 7.1114 16.0067 8.0677 2.8983 4.2533 15.1869 10.7480 1.2887 25.6421 1.5910 4.3746 1.9616 49.6580 13.9852 84.1086 1.0429 13.6013 16.4029 1.5620 11.0674 3.8898 17.1845 3.3439 0.1482 20.2018 28.2709 26.8643 16.3198 1.3556 5.8041 47.9350 21.8828 3.6220 54.7919 16.9635 23.6609 183.7457 11.2462 458.5894 192.4202 8.7974 42.5036 19.6110 97.3755 54.0561 9.4076 62.1934 21.9465 30.4012 55.1854 39.1743 9.6322 5.3930 101.7109 36.1327 14.4294 11.4147 33.4357 30.8855 38.9971
temp: 298.150 k
press: 1.00000 atm
elementType: 7 7 6 6 6 6 6 6 6 6 6 6 6 6 6 6 1 1 1 1 1 1 1 1 1 1 1 1 1 1 1 1 1 1 1 1
symmnumber: 1
zpe: 817731.5 jmol-1
zpe.correction: 0.311457 hartree
zpe.thermalcorrener: 0.327162 hartree
zpe.thermalcorrenthalpy: 0.328107 hartree
zpe.thermalcorrgfe: 0.267412 hartree
zpe.sumelectzpe: -653.791014 hartree
zpe.sumelectthermal: -653.775309 hartree
zpe.sumelectthermalent: -653.774365 hartree
zpe.sumelectthermalfe: -653.835059 hartree
dipole: 2.4722 2.6547 0.9009
dipole: 3.7378
quadrupole: -89.5815 -90.6756 -99.8426
quadrupole: 0.2308 -1.6266 0.0648
quadrupole: 3.7851 2.6909 -6.4761 0.2308 -1.6266 0.0648
hfenergy: -654.1024714 hartree
pointgroup: C01 [X(C14H20N2)]
dipole: 0.9716205 1.0975362 0.1179747 debye
polarizability: 234.5783926|17.4393667|165.3940642|-14.9446024|-14.8208628|110.6155395 unknown
InChI: InChI=1S/C14H20N2/c1-11(2)10-15-14-9-5-7-12-6-3-4-8-13(12)16-14/h3-4,6,8,11,15H,5,7,9-10H2,1-2H3
charge 0 multiplicity 1
36 atoms
N  2.158448 0.933049 -0.385292
N  0.219445 -0.385575 -0.294085
C  -0.827491 2.679682 0.058402
C  0.222297 1.850543 0.854489
C  -1.696546 1.782419 -0.867385
C  4.074794 -0.731453 -0.445269
C  0.847385 0.733999 0.01946
C  2.919413 -0.020462 -1.206511
C  -2.134051 0.468127 -0.235581
C  -1.155645 -0.555308 0.00785
C  3.539101 -1.598003 0.716531
C  5.143169 0.274564 0.047921
C  -3.49279 0.19942 0.050213
C  -1.583157 -1.81925 0.499121
C  -3.905617 -1.049058 0.571345
C  -2.94162 -2.062038 0.789074
H  -0.32296 3.449017 -0.558367
H  -1.467643 3.213277 0.78733
H  -0.290071 1.367672 1.707695
H  0.998482 2.518998 1.274014
H  -1.100184 1.550766 -1.773765
H  -2.581325 2.355216 -1.201162
H  4.55613 -1.401034 -1.189808
H  3.336941 0.512607 -2.085591
H  2.18967 -0.76626 -1.565346
H  2.623226 1.784835 -0.073703
H  2.8122 -2.346125 0.353273
H  3.020198 -0.96858 1.46313
H  4.364091 -2.128078 1.227884
H  4.729647 0.945947 0.826041
H  5.528359 0.899078 -0.781014
H  6.002408 -0.254155 0.49958
H  -4.23918 0.980284 -0.145954
H  -0.825225 -2.596152 0.645633
H  -4.963299 -1.233451 0.789745
H  -3.249003 -3.040118 1.1773
