program: Orca
programVersion: 5.0.2
elementType: F F F O O O O N N N N C C C C C C C C C C C C C H H H H H H H H H H H H H H H H H
charge: 0
multiplicity: 1
keywords: wb97x-d3
keywords: def2-TZVPP
keywords: def2/J RIJCOSX
keywords: DEFGRID2
keywords: scfconv7
keywords: smallprint printgap noloewdin
keywords: NOSOSCF
formula: C13H17F3N4O4
InChI: InChI=1/C13H17F3N4O4/c1-3-5-18(6-4-2)11-9(19(21)22)7-8(13(14,15)16)10(17)12(11)20(23)24/h7H,3-6,17H2,1-2H3
41 atoms
F  -4.354867 0.034722 1.048756
F  -4.08878 1.793416 -0.152997
F  -4.334993 -0.120543 -1.092932
O  -0.113658 -3.344404 0.167531
O  1.059994 -2.246577 1.564365
O  1.541196 2.367568 -1.366707
O  0.220062 3.546327 -0.17718
N  1.915419 -0.093824 -0.002983
N  0.265912 -2.295329 0.654628
N  0.621443 2.475811 -0.584901
N  -2.479102 -2.089023 0.072268
C  0.565193 0.045521 -0.006853
C  2.568029 -1.174698 -0.731661
C  2.76908 0.832936 0.731511
C  3.58046 -0.665759 -1.752236
C  3.676255 0.135326 1.740805
C  -0.297391 -1.061675 0.16024
C  -0.075736 1.289862 -0.16168
C  -1.71299 -0.999677 0.044873
C  -2.275758 0.307389 -0.022913
C  -1.457159 1.404158 -0.099613
C  4.12481 -1.821546 -2.57704
C  4.451201 1.162944 2.550886
C  -3.756083 0.507645 -0.056733
H  3.060902 -1.876015 -0.052066
H  1.808136 -1.734232 -1.279336
H  2.133316 1.525933 1.284742
H  3.384213 1.429528 0.053064
H  3.101172 0.067393 -2.404662
H  4.406642 -0.155551 -1.252054
H  3.077204 -0.487256 2.407736
H  4.378435 -0.52739 1.230123
H  -1.894191 2.386847 -0.204327
H  3.333017 -2.308853 -3.1483
H  4.878812 -1.478189 -3.285178
H  4.589551 -2.579006 -1.94354
H  3.78049 1.80053 3.128989
H  5.130642 0.678128 3.251855
H  5.049531 1.810173 1.907501
H  -3.480594 -2.052453 0.143411
H  -2.072178 -3.008373 0.02845
elementType: F O N C H
totalener: -1325.04237670 hartree
nucrepener: 2326.61476589 hartree
electener: -3651.65714259 hartree
oneelecener: -6440.46419543 hartree
twoeener: 2788.80705284 hartree
cpcmener: -0.03053786 hartree
kineticenergy: 1320.02335120 hartree
xcener: -118.717945379732 hartree
chargesum: 0.0000000
charge: -0.182944 -0.173061 -0.182018 -0.399261 -0.381731 -0.392867 -0.411942 -0.071511 0.553878 0.557097 -0.212700 0.163803 -0.106705 -0.114225 -0.077530 -0.075004 -0.024776 -0.133529 0.017201 -0.108901 0.012339 -0.285805 -0.286430 0.550972 0.109822 0.112131 0.117413 0.105880 0.069121 0.069375 0.069116 0.070256 0.139331 0.085168 0.092921 0.083675 0.084734 0.093595 0.083073 0.178602 0.201437
qa: -0.1829 -0.1731 -0.1820 -0.3993 -0.3817 -0.3929 -0.4119 -0.0715 0.5539 0.5571 -0.2127 0.1638 -0.1067 -0.1142 -0.0775 -0.0750 -0.0248 -0.1335 0.0172 -0.1089 0.0123 -0.2858 -0.2864 0.5510 0.1098 0.1121 0.1174 0.1059 0.0691 0.0694 0.0691 0.0703 0.1393 0.0852 0.0929 0.0837 0.0847 0.0936 0.0831 0.1786 0.2014
va: 1.1161 1.1333 1.1163 1.8183 1.8563 1.8395 1.8263 3.0905 4.0575 4.0558 3.3529 4.1590 3.8626 3.8718 3.8498 3.8495 3.7689 3.9596 4.2533 3.8214 4.0097 3.9546 3.9565 4.4349 0.9888 0.9906 0.9866 0.9871 1.0200 1.0090 1.0195 1.0090 1.0397 1.0004 1.0037 1.0007 1.0005 1.0034 1.0012 1.0232 1.0240
dispcorr: -0.022310276 hartree
energy: -1325.064686978019
dipole: 53.93071 -54.13621 -0.20551 -7.79116 6.33292 -1.45824 0.10222 -0.13102 -0.02880
magnitude: 1.47293 au
magnitude: 3.74389 debye
