program: Orca
programVersion: 5.0.2
elementType: F F F O O O O N N N N C C C C C C C C C C C C C H H H H H H H H H H H H H H H H H
charge: 0
multiplicity: 1
keywords: wb97x-d3
keywords: def2-TZVPP
keywords: def2/J RIJCOSX
keywords: DEFGRID2
keywords: scfconv7
keywords: smallprint printgap noloewdin
keywords: NOSOSCF
formula: C13H17F3N4O4
InChI: InChI=1/C13H17F3N4O4/c1-3-5-18(6-4-2)11-9(19(21)22)7-8(13(14,15)16)10(17)12(11)20(23)24/h7H,3-6,17H2,1-2H3
41 atoms
F  -3.938903 1.706321 -0.365412
F  -4.15396 -0.244888 -1.232424
F  -4.243644 0.001394 0.901829
O  0.126652 -3.388099 0.073701
O  1.047014 -2.348026 1.69231
O  0.332537 3.475173 -0.187034
O  1.777168 2.302943 -1.228039
N  2.056771 -0.167022 0.181781
N  0.385197 -2.369164 0.683908
N  0.784202 2.405212 -0.54048
N  -2.330062 -2.169474 0.066165
C  0.706401 -0.023876 0.059769
C  2.81594 -1.145668 -0.594672
C  2.845423 0.777386 0.962677
C  3.044219 -0.744123 -2.047453
C  3.483809 0.136478 2.191444
C  -0.16326 -1.123933 0.190181
C  0.070071 1.215155 -0.160361
C  -1.569391 -1.0739 0.02015
C  -2.131797 0.227004 -0.111959
C  -1.312909 1.324004 -0.176986
C  1.783795 -0.768035 -2.898982
C  4.289131 1.165517 2.970079
C  -3.610219 0.425349 -0.204052
H  3.776268 -1.272417 -0.097164
H  2.360476 -2.135449 -0.590002
H  2.205401 1.581414 1.325567
H  3.62014 1.234578 0.339942
H  3.526654 0.234739 -2.097775
H  3.764018 -1.45852 -2.456049
H  2.700377 -0.281938 2.826803
H  4.134522 -0.691733 1.902259
H  -1.747241 2.302055 -0.325369
H  1.267152 -1.726023 -2.808067
H  1.076358 0.014618 -2.625173
H  2.025146 -0.622169 -3.952476
H  4.764701 0.715347 3.841378
H  5.076987 1.603689 2.354919
H  3.655642 1.98045 3.325018
H  -3.334101 -2.136755 0.067433
H  -1.926882 -3.090723 0.044867
elementType: F O N C H
totalener: -1325.03917017 hartree
nucrepener: 2361.88706815 hartree
electener: -3686.92623831 hartree
oneelecener: -6511.05690307 hartree
twoeener: 2824.13066475 hartree
cpcmener: -0.03060594 hartree
kineticenergy: 1320.02279664 hartree
xcener: -118.716195490865 hartree
chargesum: 0.0000000
charge: -0.173424 -0.181961 -0.181998 -0.388203 -0.363585 -0.411635 -0.388496 -0.051523 0.527554 0.558550 -0.212551 0.018999 -0.078814 -0.073396 -0.111562 -0.085232 -0.027008 -0.114689 0.067475 -0.103312 0.030993 -0.255260 -0.282879 0.549636 0.108544 0.107860 0.107903 0.101971 0.065481 0.078324 0.058462 0.069149 0.138870 0.083748 0.077495 0.100861 0.092245 0.082355 0.083962 0.177308 0.197780
qa: -0.1734 -0.1820 -0.1820 -0.3882 -0.3636 -0.4116 -0.3885 -0.0515 0.5276 0.5586 -0.2126 0.0190 -0.0788 -0.0734 -0.1116 -0.0852 -0.0270 -0.1147 0.0675 -0.1033 0.0310 -0.2553 -0.2829 0.5496 0.1085 0.1079 0.1079 0.1020 0.0655 0.0783 0.0585 0.0691 0.1389 0.0837 0.0775 0.1009 0.0922 0.0824 0.0840 0.1773 0.1978
va: 1.1329 1.1171 1.1173 1.8226 1.8628 1.8257 1.8443 3.0502 4.0841 4.0716 3.3481 4.2712 3.8903 3.8771 3.8696 3.8542 3.7144 3.9113 4.1867 3.8354 3.9836 3.9109 3.9558 4.4356 1.0048 1.0028 0.9874 0.9952 1.0126 1.0126 1.0217 1.0151 1.0409 1.0071 1.0034 1.0044 1.0039 1.0015 1.0004 1.0240 1.0210
dispcorr: -0.024070379 hartree
energy: -1325.063240544450
dipole: 46.48253 -46.76034 -0.27781 -4.77712 3.26949 -1.50763 1.61040 -1.59577 0.01463
magnitude: 1.53308 au
magnitude: 3.89678 debye
