program: Orca
programVersion: 5.0.2
elementType: F F F O O O O N N N N C C C C C C C C C C C C C H H H H H H H H H H H H H H H H H
charge: 0
multiplicity: 1
keywords: wb97x-d3
keywords: def2-TZVPP
keywords: def2/J RIJCOSX
keywords: DEFGRID2
keywords: scfconv7
keywords: smallprint printgap noloewdin
keywords: NOSOSCF
formula: C13H17F3N4O4
InChI: InChI=1/C13H17F3N4O4/c1-3-5-18(6-4-2)11-9(19(21)22)7-8(13(14,15)16)10(17)12(11)20(23)24/h7H,3-6,17H2,1-2H3
41 atoms
F  -3.860175 1.767126 -0.192163
F  -4.144305 -0.174317 -1.060496
F  -4.112177 0.053547 1.077315
O  1.262805 -2.421912 1.443047
O  0.075865 -3.393312 -0.031744
O  0.431839 3.483721 -0.331633
O  1.802905 2.256158 -1.409022
N  2.130312 -0.148749 0.065284
N  0.464431 -2.391241 0.538487
N  0.853137 2.395147 -0.669188
N  -2.288956 -2.118888 0.112567
C  0.781082 -0.013639 -0.019149
C  2.985956 0.773347 0.80848
C  2.839263 -1.185457 -0.674455
C  2.381911 1.414113 2.051629
C  3.7637 -0.619676 -1.748706
C  -0.089752 -1.119671 0.126757
C  0.147062 1.228401 -0.215563
C  -1.50478 -1.042649 0.038747
C  -2.057653 0.268026 -0.047138
C  -1.234262 1.355583 -0.158568
C  1.868287 0.436162 3.096156
C  4.472581 -1.744033 -2.486992
C  -3.536939 0.481801 -0.058543
H  3.833217 0.165518 1.137491
H  3.41012 1.550985 0.16783
H  2.123648 -1.833987 -1.180671
H  3.419486 -1.805564 0.015897
H  3.191169 2.009272 2.481294
H  1.599048 2.136289 1.813919
H  3.176933 -0.023485 -2.450507
H  4.504982 0.047809 -1.304412
H  -1.664736 2.338086 -0.286815
H  2.608733 -0.333797 3.318649
H  1.650035 0.961499 4.026239
H  0.948291 -0.058984 2.787227
H  5.140788 -1.349321 -3.252323
H  5.072862 -2.350268 -1.806576
H  3.760749 -2.407577 -2.981202
H  -3.286877 -2.059801 0.211257
H  -1.907447 -3.048998 0.086574
elementType: F O N C H
totalener: -1325.03951408 hartree
nucrepener: 2366.43660356 hartree
electener: -3691.47611764 hartree
oneelecener: -6520.20428755 hartree
twoeener: 2828.72816991 hartree
cpcmener: -0.03031413 hartree
kineticenergy: 1320.02296732 hartree
xcener: -118.719478616558 hartree
chargesum: 0.0000000
charge: -0.173072 -0.181715 -0.182124 -0.369983 -0.395954 -0.411742 -0.396336 -0.023769 0.549455 0.568332 -0.210781 0.057788 -0.135950 -0.054861 -0.089615 -0.082470 0.021944 -0.182285 0.011857 -0.098952 0.022361 -0.278199 -0.285021 0.549710 0.106288 0.116088 0.103149 0.100533 0.083679 0.078909 0.062715 0.074380 0.140600 0.086707 0.102115 0.081054 0.093117 0.081694 0.084907 0.178364 0.197082
qa: -0.1731 -0.1817 -0.1821 -0.3700 -0.3960 -0.4117 -0.3963 -0.0238 0.5495 0.5683 -0.2108 0.0578 -0.1360 -0.0549 -0.0896 -0.0825 0.0219 -0.1823 0.0119 -0.0990 0.0224 -0.2782 -0.2850 0.5497 0.1063 0.1161 0.1031 0.1005 0.0837 0.0789 0.0627 0.0744 0.1406 0.0867 0.1021 0.0811 0.0931 0.0817 0.0849 0.1784 0.1971
va: 1.1334 1.1180 1.1172 1.8657 1.8153 1.8199 1.8362 3.0441 4.0753 4.0622 3.3496 4.1640 3.8994 3.8439 3.8756 3.8518 3.7381 3.9742 4.2556 3.8324 4.0074 3.9238 3.9562 4.4354 0.9929 0.9946 0.9933 1.0018 1.0115 1.0092 1.0213 1.0089 1.0420 1.0019 1.0057 1.0022 1.0032 1.0019 1.0000 1.0237 1.0248
dispcorr: -0.024019937 hartree
energy: -1325.063534017423
dipole: 46.12686 -46.39398 -0.26712 -7.03902 5.70792 -1.33110 2.64002 -2.37229 0.26773
magnitude: 1.38379 au
magnitude: 3.51730 debye
