program: Orca
programVersion: 5.0.2
elementType: F F F O O O O N N N N C C C C C C C C C C C C C H H H H H H H H H H H H H H H H H
charge: 0
multiplicity: 1
keywords: wb97x-d3
keywords: def2-TZVPP
keywords: def2/J RIJCOSX
keywords: DEFGRID2
keywords: scfconv7
keywords: smallprint printgap noloewdin
keywords: NOSOSCF
formula: C13H17F3N4O4
InChI: InChI=1/C13H17F3N4O4/c1-3-5-18(6-4-2)11-9(19(21)22)7-8(13(14,15)16)10(17)12(11)20(23)24/h7H,3-6,17H2,1-2H3
41 atoms
F  -4.03822 0.562487 1.108989
F  -3.842531 1.548464 -0.791728
F  -4.114554 -0.582664 -0.707381
O  1.361816 -1.254079 2.471851
O  0.220727 -2.892709 1.710635
O  0.477475 2.898102 -1.957978
O  1.790408 1.262104 -2.386388
N  2.168052 -0.177466 -0.000072
N  0.57291 -1.72874 1.699882
N  0.878105 1.770557 -1.780722
N  -2.200268 -1.690452 1.348282
C  0.809913 -0.024652 -0.043615
C  3.064678 0.928762 0.298305
C  2.811719 -1.448273 -0.298881
C  2.479833 2.015571 1.189571
C  2.090431 -2.308568 -1.328066
C  -0.035265 -0.852165 0.711733
C  0.16896 0.961717 -0.807647
C  -1.446415 -0.810327 0.665766
C  -2.015276 0.267577 -0.058658
C  -1.203019 1.13148 -0.756714
C  3.546113 3.037637 1.56017
C  2.917011 -3.53944 -1.675186
C  -3.499051 0.454497 -0.117252
H  3.906087 0.488789 0.842216
H  3.485918 1.365744 -0.614795
H  3.024789 -2.028972 0.6084
H  3.787518 -1.192413 -0.720647
H  1.653165 2.538943 0.70572
H  2.070281 1.553477 2.090509
H  1.113868 -2.633339 -0.963966
H  1.909866 -1.708303 -2.222407
H  -1.642841 1.929742 -1.33666
H  3.959453 3.520619 0.673661
H  3.13272 3.819777 2.195355
H  4.372697 2.577085 2.103126
H  3.104557 -4.15361 -0.793272
H  2.402328 -4.16311 -2.404812
H  3.883533 -3.266694 -2.101281
H  -3.198475 -1.617779 1.382194
H  -1.795615 -2.548929 1.676184
totalener: -1325.03259901 hartree
nucrepener: 2363.15616464 hartree
electener: -3688.18876365 hartree
oneelecener: -6513.82353486 hartree
twoeener: 2825.63477121 hartree
kineticenergy: 1320.06799316 hartree
xcener: -118.717148908090 hartree
chargesum: -0.0000000
charge: -0.177167 -0.161760 -0.171644 -0.299744 -0.349136 -0.331432 -0.327617 -0.026968 0.514558 0.515132 -0.259295 0.081183 -0.130308 -0.100158 -0.066277 -0.074953 -0.105943 -0.247991 0.118423 -0.103635 0.032600 -0.267282 -0.267151 0.540743 0.087350 0.109882 0.097927 0.086392 0.077065 0.077367 0.076350 0.079207 0.143863 0.082495 0.090063 0.076120 0.081328 0.089662 0.077428 0.152523 0.180801
qa: -0.1772 -0.1618 -0.1716 -0.2997 -0.3491 -0.3314 -0.3276 -0.0270 0.5146 0.5151 -0.2593 0.0812 -0.1303 -0.1002 -0.0663 -0.0750 -0.1059 -0.2480 0.1184 -0.1036 0.0326 -0.2673 -0.2672 0.5407 0.0873 0.1099 0.0979 0.0864 0.0771 0.0774 0.0763 0.0792 0.1439 0.0825 0.0901 0.0761 0.0813 0.0897 0.0774 0.1525 0.1808
va: 1.1246 1.1490 1.1297 1.9332 1.8540 1.8950 1.9006 2.9704 4.1192 4.1309 3.2958 4.0586 3.8964 3.8938 3.8504 3.8551 3.8689 4.1005 4.0834 3.8992 3.9698 3.9690 3.9623 4.4487 0.9961 0.9927 0.9959 0.9961 1.0053 1.0126 1.0030 1.0147 1.0417 1.0026 1.0049 1.0036 1.0031 1.0048 1.0038 1.0464 1.0419
dispcorr: -0.023713600 hartree
energy: -1325.056312610364
dipole: 43.96921 -44.09989 -0.13067 -6.44747 5.67274 -0.77473 1.38056 -0.91591 0.46466
magnitude: 0.91279 au
magnitude: 2.32012 debye
