program: Orca
programVersion: 5.0.2
elementType: F F F O O O O N N N N C C C C C C C C C C C C C H H H H H H H H H H H H H H H H H
charge: 0
multiplicity: 1
keywords: wb97x-d3
keywords: def2-TZVPP
keywords: def2/J RIJCOSX
keywords: DEFGRID2
keywords: scfconv7
keywords: smallprint printgap noloewdin
keywords: NOSOSCF
formula: C13H17F3N4O4
InChI: InChI=1/C13H17F3N4O4/c1-3-5-18(6-4-2)11-9(19(21)22)7-8(13(14,15)16)10(17)12(11)20(23)24/h7H,3-6,17H2,1-2H3
41 atoms
F  -3.705666 1.856196 -0.295614
F  -4.056475 -0.15591 -0.958675
F  -3.985318 0.282356 1.142921
O  1.303481 -2.201477 1.751816
O  0.062597 -3.384003 0.479921
O  0.635831 3.42079 -0.492921
O  2.030008 2.126866 -1.469445
N  2.209018 -0.320642 -0.116865
N  0.495133 -2.314763 0.868619
N  1.054664 2.32382 -0.785429
N  -2.257247 -2.021361 0.455541
C  0.868911 -0.077833 -0.064575
C  3.179498 0.47157 0.6281
C  2.775892 -1.464627 -0.819352
C  2.650279 1.154776 1.882022
C  2.013974 -1.952249 -2.045046
C  -0.036982 -1.105003 0.26459
C  0.293388 1.181101 -0.317917
C  -1.444365 -0.981699 0.207764
C  -1.94642 0.322974 -0.026593
C  -1.077288 1.36468 -0.246521
C  3.790228 1.804458 2.656145
C  1.831391 -0.902563 -3.130848
C  -3.418877 0.58461 -0.037785
H  3.946379 -0.237349 0.955637
H  3.684519 1.194248 -0.020826
H  2.976735 -2.301629 -0.139038
H  3.755337 -1.127265 -1.171063
H  1.909583 1.922366 1.653189
H  2.146289 0.413669 2.505965
H  2.599544 -2.786472 -2.440004
H  1.047853 -2.386615 -1.783907
H  -1.468219 2.353317 -0.436949
H  3.419249 2.298958 3.552779
H  4.532478 1.068817 2.969269
H  4.301276 2.557322 2.054716
H  1.162963 -0.100088 -2.825393
H  2.781407 -0.443248 -3.4056
H  1.408732 -1.354851 -4.027765
H  -3.253822 -1.922719 0.480164
H  -1.892293 -2.956863 0.438372
totalener: -1325.03201871 hartree
nucrepener: 2387.13242710 hartree
electener: -3712.16444581 hartree
oneelecener: -6561.80675723 hartree
twoeener: 2849.64231142 hartree
kineticenergy: 1320.07391845 hartree
xcener: -118.722003251058 hartree
chargesum: -0.0000000
charge: -0.161371 -0.175085 -0.174978 -0.307174 -0.351704 -0.334906 -0.328457 0.026057 0.516882 0.528321 -0.258224 0.044413 -0.133154 -0.114395 -0.056389 -0.121942 -0.089226 -0.273217 0.093716 -0.114942 0.039621 -0.269625 -0.239905 0.542568 0.087371 0.116980 0.107254 0.094353 0.075065 0.079579 0.076124 0.088327 0.145191 0.090126 0.076734 0.083592 0.084527 0.078798 0.092812 0.153419 0.182868
qa: -0.1614 -0.1751 -0.1750 -0.3072 -0.3517 -0.3349 -0.3285 0.0261 0.5169 0.5283 -0.2582 0.0444 -0.1332 -0.1144 -0.0564 -0.1219 -0.0892 -0.2732 0.0937 -0.1149 0.0396 -0.2696 -0.2399 0.5426 0.0874 0.1170 0.1073 0.0944 0.0751 0.0796 0.0761 0.0883 0.1452 0.0901 0.0767 0.0836 0.0845 0.0788 0.0928 0.1534 0.1829
va: 1.1499 1.1264 1.1264 1.9274 1.8525 1.8895 1.8927 2.9684 4.1075 4.1241 3.3081 4.0612 3.8925 3.9052 3.8451 3.9077 3.8380 4.0541 4.1096 3.9002 3.9565 3.9702 3.9281 4.4493 0.9962 0.9921 1.0009 0.9923 1.0076 1.0131 1.0129 1.0048 1.0436 1.0050 1.0037 1.0023 1.0055 1.0077 1.0046 1.0458 1.0435
dispcorr: -0.024771262 hartree
energy: -1325.056789970281
dipole: 41.60557 -41.70102 -0.09545 -5.62577 4.64133 -0.98444 -1.19644 1.21923 0.02279
magnitude: 0.98932 au
magnitude: 2.51465 debye
