program: Orca
programVersion: 5.0.2
elementType: F F F O O O O N N N N C C C C C C C C C C C C C H H H H H H H H H H H H H H H H H
charge: 0
multiplicity: 1
keywords: wb97x-d3
keywords: def2-TZVPP
keywords: def2/J RIJCOSX
keywords: DEFGRID2
keywords: scfconv7
keywords: smallprint printgap noloewdin
keywords: NOSOSCF
formula: C13H17F3N4O4
InChI: InChI=1/C13H17F3N4O4/c1-3-5-18(6-4-2)11-9(19(21)22)7-8(13(14,15)16)10(17)12(11)20(23)24/h7H,3-6,17H2,1-2H3
41 atoms
F  -4.071492 -0.248913 -1.346247
F  -4.26987 -0.213516 0.792038
F  -4.037772 1.627079 -0.29768
O  1.131332 -2.31154 1.541143
O  0.289394 -3.243341 -0.188965
O  1.691572 2.545526 -1.04666
O  0.208347 3.603224 0.077177
N  2.051066 0.032059 0.166759
N  0.49153 -2.280309 0.525301
N  0.700935 2.588604 -0.357787
N  -2.229786 -2.162429 -0.03021
C  0.690469 0.123666 0.079549
C  2.81673 -0.855326 -0.697063
C  2.805396 0.878142 1.073564
C  2.278368 -0.947194 -2.119904
C  3.513862 0.082099 2.165909
C  -0.122195 -1.018243 0.142202
C  0.009749 1.343261 -0.072234
C  -1.521854 -1.016774 -0.031173
C  -2.142119 0.254059 -0.101829
C  -1.372339 1.395545 -0.099946
C  3.180163 -1.805619 -2.994113
C  4.328203 0.993287 3.072964
C  -3.626971 0.364564 -0.236649
H  3.820266 -0.424013 -0.747883
H  2.953517 -1.856959 -0.272165
H  2.127577 1.581226 1.561156
H  3.532959 1.47588 0.51372
H  1.272325 -1.371378 -2.133118
H  2.197934 0.062072 -2.528754
H  2.771729 -0.467128 2.746881
H  4.170741 -0.668176 1.718108
H  -1.846611 2.362018 -0.192365
H  3.246944 -2.826254 -2.614801
H  2.797443 -1.859458 -4.012543
H  4.192803 -1.402582 -3.045794
H  5.100581 1.527278 2.51721
H  3.698305 1.740402 3.55878
H  4.823985 0.423816 3.858262
H  -3.22793 -2.16099 -0.112669
H  -1.768259 -3.033188 -0.222798
totalener: -1325.03544417 hartree
nucrepener: 2345.71338088 hartree
electener: -3670.74882506 hartree
oneelecener: -6478.89163818 hartree
twoeener: 2808.14281313 hartree
kineticenergy: 1320.07739232 hartree
xcener: -118.716934553225 hartree
chargesum: -0.0000000
charge: -0.174321 -0.175277 -0.161245 -0.298590 -0.348005 -0.322143 -0.332214 -0.037427 0.507690 0.493305 -0.261869 0.086443 -0.124420 -0.109920 -0.066143 -0.070244 -0.132053 -0.147155 0.121741 -0.105324 0.000298 -0.265287 -0.254980 0.542828 0.083359 0.102558 0.095478 0.101875 0.073961 0.080361 0.070928 0.062478 0.143249 0.082232 0.089449 0.075975 0.075116 0.077164 0.088539 0.152197 0.179396
qa: -0.1743 -0.1753 -0.1612 -0.2986 -0.3480 -0.3221 -0.3322 -0.0374 0.5077 0.4933 -0.2619 0.0864 -0.1244 -0.1099 -0.0661 -0.0702 -0.1321 -0.1472 0.1217 -0.1053 0.0003 -0.2653 -0.2550 0.5428 0.0834 0.1026 0.0955 0.1019 0.0740 0.0804 0.0709 0.0625 0.1432 0.0822 0.0894 0.0760 0.0751 0.0772 0.0885 0.1522 0.1794
va: 1.1257 1.1274 1.1502 1.9194 1.8576 1.9024 1.8979 3.0004 4.1187 4.1345 3.2886 4.1927 3.9212 3.9039 3.8519 3.8406 3.8665 4.0429 4.0774 3.8909 4.0004 3.9596 3.9541 4.4491 0.9970 0.9892 0.9935 0.9964 1.0061 1.0167 1.0221 1.0127 1.0407 1.0034 1.0053 1.0033 1.0044 1.0034 1.0055 1.0474 1.0411
dispcorr: -0.023178252 hartree
energy: -1325.058622426670
dipole: 48.82958 -48.80980 0.01978 -7.42456 6.47758 -0.94698 1.46590 -1.58964 -0.12374
magnitude: 0.95524 au
magnitude: 2.42802 debye
