program: Orca
programVersion: 5.0.2
elementType: O O O O N N N C C C C C C C C C C C C C H H H H H H H H H H H H H H H H H H H
charge: 0
multiplicity: 1
keywords: wb97x-d3
keywords: def2-TZVPP
keywords: def2/J RIJCOSX
keywords: DEFGRID2
keywords: scfconv7
keywords: smallprint printgap noloewdin
keywords: NOSOSCF
formula: C13H19N3O4
InChI: InChI=1/C13H19N3O4/c1-5-10(6-2)14-12-11(15(17)18)7-8(3)9(4)13(12)16(19)20/h7,10,14H,5-6H2,1-4H3
39 atoms
O  0.24901 2.537904 -1.429042
O  0.506748 2.878968 0.666638
O  0.184528 -2.838369 -1.211285
O  -1.551776 -3.494373 -0.175397
N  1.026718 -0.332224 -0.910292
N  0.076558 2.24817 -0.269735
N  -0.814725 -2.608403 -0.550007
C  2.262716 0.26422 -0.37686
C  3.412678 -0.32134 -1.19474
C  2.404742 0.038844 1.130711
C  -0.219926 -0.186294 -0.391207
C  -0.732334 1.068569 0.010057
C  -1.135474 -1.253162 -0.206387
C  -1.97901 1.294785 0.568157
C  4.770521 0.234295 -0.80004
C  2.563285 -1.416668 1.541371
C  -2.831469 0.190595 0.759103
C  -2.396466 -1.046495 0.353428
C  -2.474309 2.655632 0.946348
C  -4.190113 0.354741 1.367672
H  2.286612 1.337799 -0.56764
H  3.419071 -1.411741 -1.103689
H  3.226232 -0.101727 -2.248656
H  1.539028 0.466509 1.643356
H  3.261476 0.619255 1.480985
H  1.185749 -1.270768 -1.245397
H  5.060296 -0.061008 0.208935
H  5.54238 -0.129734 -1.478102
H  4.782872 1.324839 -0.843707
H  2.574381 -1.505747 2.627779
H  1.744489 -2.038042 1.174943
H  3.494852 -1.84759 1.172548
H  -3.059335 -1.89075 0.477558
H  -1.931743 3.482956 0.498559
H  -3.517321 2.765844 0.654053
H  -2.432139 2.779229 2.030332
H  -4.667247 -0.613444 1.507675
H  -4.137727 0.844461 2.341208
H  -4.847196 0.959479 0.739974
elementType: O N C H
totalener: -971.90280120 hartree
nucrepener: 1702.17540024 hartree
electener: -2674.07820143 hartree
oneelecener: -4703.79331369 hartree
twoeener: 2029.71511225 hartree
cpcmener: -0.02675538 hartree
kineticenergy: 967.90530700 hartree
xcener: -91.750460327963 hartree
chargesum: -0.0000000
charge: -0.360609 -0.357592 -0.416194 -0.419529 -0.258179 0.511556 0.555921 0.103725 -0.130748 -0.105815 0.001662 0.120992 0.010515 -0.068242 -0.288786 -0.296627 -0.006840 -0.030106 -0.258363 -0.237380 0.084681 0.077596 0.087538 0.074978 0.087890 0.191533 0.082432 0.096331 0.087966 0.099081 0.082371 0.086217 0.141456 0.094982 0.111587 0.128001 0.097433 0.109046 0.109522
qa: -0.3606 -0.3576 -0.4162 -0.4195 -0.2582 0.5116 0.5559 0.1037 -0.1307 -0.1058 0.0017 0.1210 0.0105 -0.0682 -0.2888 -0.2966 -0.0068 -0.0301 -0.2584 -0.2374 0.0847 0.0776 0.0875 0.0750 0.0879 0.1915 0.0824 0.0963 0.0880 0.0991 0.0824 0.0862 0.1415 0.0950 0.1116 0.1280 0.0974 0.1090 0.1095
va: 1.8618 1.8629 1.8147 1.8411 3.1944 4.1396 4.0822 3.8785 3.8890 3.8295 4.2668 3.6793 3.8216 3.9128 3.9531 3.9509 3.8172 3.9455 3.9245 3.9056 1.0137 1.0027 1.0151 1.0183 1.0050 1.0396 0.9992 1.0038 0.9995 1.0048 1.0015 0.9983 1.0344 1.0105 0.9971 0.9936 1.0064 0.9931 0.9933
dispcorr: -0.020827469 hartree
energy: -971.923628665463
dipole: 12.59563 -13.52481 -0.92918 3.33962 -2.44785 0.89177 8.78300 -7.53077 1.25223
magnitude: 1.79630 au
magnitude: 4.56584 debye
