program: Orca
programVersion: 5.0.2
elementType: O O O O N N N C C C C C C C C C C C C C H H H H H H H H H H H H H H H H H H H
charge: 0
multiplicity: 1
keywords: wb97x-d3
keywords: def2-TZVPP
keywords: def2/J RIJCOSX
keywords: DEFGRID2
keywords: scfconv7
keywords: smallprint printgap noloewdin
keywords: NOSOSCF
formula: C13H19N3O4
InChI: InChI=1/C13H19N3O4/c1-5-10(6-2)14-12-11(15(17)18)7-8(3)9(4)13(12)16(19)20/h7,10,14H,5-6H2,1-4H3
39 atoms
O  0.25946 2.542409 -1.392619
O  0.489465 2.87369 0.7084
O  0.177805 -2.839659 -1.195098
O  -1.547431 -3.495757 -0.140716
N  1.029573 -0.339514 -0.866437
N  0.073761 2.247834 -0.237452
N  -0.817101 -2.611741 -0.52793
C  2.269008 0.259916 -0.351017
C  3.405907 -0.312709 -1.19714
C  2.436334 0.02246 1.152553
C  -0.222264 -0.187692 -0.365848
C  -0.739439 1.067453 0.027491
C  -1.142658 -1.253317 -0.192802
C  -1.996034 1.295981 0.562841
C  4.769784 0.24799 -0.832012
C  2.603359 -1.435172 1.551437
C  -2.853324 0.194586 0.741553
C  -2.411332 -1.044462 0.345643
C  -2.479284 2.664895 0.932089
C  -4.223515 0.356877 1.326368
H  2.283947 1.335675 -0.530981
H  3.421635 -1.403932 -1.11378
H  3.192019 -0.08825 -2.24536
H  1.577765 0.446291 1.680737
H  3.297164 0.602561 1.494295
H  1.182157 -1.267075 -1.23315
H  5.084595 -0.045161 0.170342
H  5.528328 -0.114212 -1.526608
H  4.77941 1.33878 -0.877241
H  2.629183 -1.531744 2.637393
H  1.781147 -2.057219 1.193033
H  3.53088 -1.863785 1.168984
H  -3.075111 -1.889606 0.460292
H  -1.997633 3.473557 0.387059
H  -3.546893 2.752509 0.740825
H  -2.326679 2.846387 1.998277
H  -4.697449 -0.613105 1.468223
H  -4.193421 0.854406 2.297038
H  -4.876385 0.948691 0.681546
elementType: O N C H
totalener: -971.91089599 hartree
nucrepener: 1700.22759633 hartree
electener: -2672.13849232 hartree
oneelecener: -4699.92459239 hartree
twoeener: 2027.78610006 hartree
cpcmener: -0.02237144 hartree
kineticenergy: 967.89540947 hartree
xcener: -91.746955879959 hartree
chargesum: 0.0000000
charge: -0.348710 -0.348354 -0.405985 -0.403098 -0.257920 0.495026 0.542449 0.103033 -0.131392 -0.108922 -0.010006 0.127344 0.012451 -0.073971 -0.286578 -0.292945 0.011770 -0.036649 -0.271500 -0.238777 0.084732 0.077043 0.088872 0.074903 0.086817 0.189184 0.081593 0.095737 0.087650 0.098371 0.081261 0.084821 0.139137 0.101622 0.110867 0.127210 0.096375 0.109739 0.106801
qa: -0.3487 -0.3484 -0.4060 -0.4031 -0.2579 0.4950 0.5424 0.1030 -0.1314 -0.1089 -0.0100 0.1273 0.0125 -0.0740 -0.2866 -0.2929 0.0118 -0.0366 -0.2715 -0.2388 0.0847 0.0770 0.0889 0.0749 0.0868 0.1892 0.0816 0.0957 0.0877 0.0984 0.0813 0.0848 0.1391 0.1016 0.1109 0.1272 0.0964 0.1097 0.1068
va: 1.8737 1.8733 1.8264 1.8611 3.1917 4.1603 4.1014 3.8783 3.8900 3.8331 4.2686 3.7054 3.8214 3.9104 3.9544 3.9501 3.7882 3.9559 3.9287 3.9116 1.0139 1.0023 1.0150 1.0184 1.0052 1.0422 0.9996 1.0040 0.9996 1.0050 1.0031 0.9985 1.0357 1.0051 0.9968 0.9937 1.0067 0.9921 0.9928
dispcorr: -0.020772571 hartree
energy: -971.931668561986
dipole: 12.67984 -13.53872 -0.85888 3.36656 -2.53291 0.83364 8.37935 -7.26858 1.11077
magnitude: 1.63292 au
magnitude: 4.15055 debye
