program: Orca
programVersion: 5.0.2
elementType: O O O O N N N C C C C C C C C C C C C C H H H H H H H H H H H H H H H H H H H
charge: 0
multiplicity: 1
keywords: wb97x-d3
keywords: def2-TZVPP
keywords: def2/J RIJCOSX
keywords: DEFGRID2
keywords: scfconv7
keywords: smallprint printgap noloewdin
keywords: NOSOSCF
formula: C13H19N3O4
InChI: InChI=1/C13H19N3O4/c1-5-10(6-2)14-12-11(15(17)18)7-8(3)9(4)13(12)16(19)20/h7,10,14H,5-6H2,1-4H3
39 atoms
O  0.49195 2.482174 -1.154311
O  0.531788 2.749544 0.966633
O  0.109925 -2.860243 -1.347099
O  -1.676772 -3.5054 -0.392906
N  1.069644 -0.45957 -0.776344
N  0.192323 2.157783 -0.030975
N  -0.893744 -2.631188 -0.691247
C  2.34856 0.090431 -0.318697
C  3.291323 0.089425 -1.521944
C  2.882572 -0.713558 0.867452
C  -0.185866 -0.257811 -0.327423
C  -0.669975 0.994795 0.123244
C  -1.16657 -1.28719 -0.27119
C  -1.942235 1.244324 0.612836
C  4.633475 0.753259 -1.258772
C  1.990083 -0.659979 2.09798
C  -2.856042 0.176462 0.681086
C  -2.447788 -1.052829 0.224225
C  -2.373752 2.615138 1.040169
C  -4.246838 0.357901 1.211326
H  2.248762 1.120166 0.014413
H  3.446404 -0.942028 -1.85632
H  2.790597 0.609202 -2.342416
H  3.866656 -0.316729 1.127902
H  3.040472 -1.752083 0.558929
H  1.190672 -1.375608 -1.186016
H  5.238006 0.206269 -0.534893
H  5.214052 0.814439 -2.179994
H  4.506648 1.771539 -0.885638
H  1.034307 -1.16148 1.942155
H  2.472474 -1.151965 2.943667
H  1.782739 0.37001 2.395917
H  -3.152174 -1.87221 0.250242
H  -2.090131 2.804788 2.076972
H  -1.955633 3.412949 0.428069
H  -3.454408 2.711874 0.979122
H  -4.76443 -0.598948 1.258755
H  -4.245939 0.781659 2.216723
H  -4.844334 1.019972 0.581351
elementType: O N C H
totalener: -971.91005730 hartree
nucrepener: 1699.21539871 hartree
electener: -2671.12545600 hartree
oneelecener: -4697.90637461 hartree
twoeener: 2026.78091860 hartree
cpcmener: -0.02219440 hartree
kineticenergy: 967.90004099 hartree
xcener: -91.747849186083 hartree
chargesum: -0.0000000
charge: -0.350327 -0.356173 -0.408770 -0.405930 -0.212181 0.501534 0.546161 0.084813 -0.083814 -0.129292 -0.117178 0.197750 0.031294 -0.101327 -0.291699 -0.279482 0.031291 -0.035633 -0.278608 -0.237686 0.086817 0.074333 0.076614 0.073831 0.069102 0.184477 0.083067 0.094995 0.086083 0.088343 0.101413 0.082435 0.137063 0.125066 0.112170 0.108987 0.095781 0.110273 0.104408
qa: -0.3503 -0.3562 -0.4088 -0.4059 -0.2122 0.5015 0.5462 0.0848 -0.0838 -0.1293 -0.1172 0.1978 0.0313 -0.1013 -0.2917 -0.2795 0.0313 -0.0356 -0.2786 -0.2377 0.0868 0.0743 0.0766 0.0738 0.0691 0.1845 0.0831 0.0950 0.0861 0.0883 0.1014 0.0824 0.1371 0.1251 0.1122 0.1090 0.0958 0.1103 0.1044
va: 1.8734 1.8664 1.8235 1.8584 3.1946 4.1477 4.0977 3.8508 3.8785 3.8871 4.2762 3.5970 3.7629 3.9371 3.9554 3.9394 3.7482 3.9618 3.9266 3.9147 1.0154 1.0093 1.0175 1.0094 1.0137 1.0457 0.9993 1.0036 0.9983 0.9963 1.0052 1.0094 1.0372 0.9955 0.9982 0.9980 1.0067 0.9908 0.9920
dispcorr: -0.020525122 hartree
energy: -971.930582417117
dipole: 11.55887 -12.24374 -0.68486 5.80680 -4.96285 0.84395 7.65384 -6.62987 1.02397
magnitude: 1.49325 au
magnitude: 3.79554 debye
