program: Orca
programVersion: 5.0.2
elementType: O O O O N N N C C C C C C C C C C C C C H H H H H H H H H H H H H H H H H H H
charge: 0
multiplicity: 1
keywords: wb97x-d3
keywords: def2-TZVPP
keywords: def2/J RIJCOSX
keywords: DEFGRID2
keywords: scfconv7
keywords: smallprint printgap noloewdin
keywords: NOSOSCF
formula: C13H19N3O4
InChI: InChI=1/C13H19N3O4/c1-5-10(6-2)14-12-11(15(17)18)7-8(3)9(4)13(12)16(19)20/h7,10,14H,5-6H2,1-4H3
39 atoms
O  0.630294 2.842831 0.484006
O  0.741913 1.539159 2.181864
O  0.079103 -3.123111 -0.459334
O  -1.886012 -3.196106 -1.276067
N  1.104133 -0.802613 0.254448
N  0.341002 1.835394 1.085422
N  -0.995394 -2.607022 -0.715877
C  2.341929 -0.074038 -0.010429
C  2.937042 -0.563728 -1.334241
C  3.308145 -0.246038 1.163217
C  -0.174693 -0.387424 0.131041
C  -0.609359 0.919735 0.456457
C  -1.22055 -1.232117 -0.328751
C  -1.905677 1.390499 0.330223
C  2.042536 -0.314992 -2.539018
C  4.493563 0.707438 1.117332
C  -2.893415 0.519508 -0.15924
C  -2.525287 -0.77001 -0.461922
C  -2.271585 2.791969 0.727962
C  -4.320215 0.952436 -0.335061
H  2.129092 0.98584 -0.144389
H  3.894344 -0.060311 -1.487147
H  3.168873 -1.630998 -1.251676
H  3.661464 -1.282241 1.184447
H  2.758012 -0.090915 2.091286
H  1.195835 -1.801125 0.133408
H  1.117027 -0.888232 -2.487939
H  1.775138 0.739693 -2.624063
H  2.545945 -0.601274 -3.46203
H  4.159197 1.746091 1.100825
H  5.120789 0.582387 1.999359
H  5.128911 0.546847 0.246218
H  -3.274816 -1.457412 -0.826272
H  -2.011746 3.499762 -0.059923
H  -3.339287 2.877015 0.908194
H  -1.772471 3.120532 1.63821
H  -4.907205 0.159028 -0.794245
H  -4.797409 1.195263 0.616342
H  -4.405884 1.831334 -0.975456
totalener: -971.89747409 hartree
nucrepener: 1698.17088998 hartree
electener: -2670.06836407 hartree
oneelecener: -4695.91476285 hartree
twoeener: 2025.84639878 hartree
kineticenergy: 967.93459694 hartree
xcener: -91.749676682074 hartree
chargesum: -0.0000000
charge: -0.321589 -0.303212 -0.363371 -0.343437 -0.202392 0.457169 0.510646 -0.003180 -0.123151 -0.068387 -0.023858 0.158326 -0.060329 -0.129122 -0.247444 -0.266790 0.067811 -0.012306 -0.278011 -0.243797 0.084452 0.069079 0.068093 0.067386 0.087193 0.168950 0.076956 0.079702 0.095436 0.086529 0.089304 0.072430 0.129685 0.123655 0.096415 0.112113 0.088047 0.096720 0.104278
qa: -0.3216 -0.3032 -0.3634 -0.3434 -0.2024 0.4572 0.5106 -0.0032 -0.1232 -0.0684 -0.0239 0.1583 -0.0603 -0.1291 -0.2474 -0.2668 0.0678 -0.0123 -0.2780 -0.2438 0.0845 0.0691 0.0681 0.0674 0.0872 0.1690 0.0770 0.0797 0.0954 0.0865 0.0893 0.0724 0.1297 0.1237 0.0964 0.1121 0.0880 0.0967 0.1043
va: 1.8876 1.9095 1.8649 1.9180 3.1684 4.1815 4.1349 3.9625 3.8755 3.8614 4.2421 3.8027 3.8986 3.9777 3.9461 3.9486 3.6715 3.9736 3.9446 3.9283 1.0158 1.0125 1.0146 1.0090 1.0233 1.0722 1.0081 1.0065 1.0081 1.0036 1.0062 1.0040 1.0426 0.9959 0.9999 0.9990 1.0107 0.9920 0.9909
dispcorr: -0.020514633 hartree
energy: -971.917988722484
dipole: 11.26317 -11.78071 -0.51754 8.79354 -7.91521 0.87833 -4.20311 3.97903 -0.22408
magnitude: 1.04380 au
magnitude: 2.65313 debye
