program: Orca
programVersion: 5.0.2
elementType: S O O O O O O N N N N C C C C C C C C C C C C H H H H H H H H H H H H H H H H H H
charge: 0
multiplicity: 1
keywords: wb97x-d3
keywords: def2-TZVPP
keywords: def2/J RIJCOSX
keywords: DEFGRID2
keywords: scfconv7
keywords: smallprint printgap noloewdin
keywords: NOSOSCF
formula: C12H18N4O6S
InChI: InChI=1/C12H18N4O6S/c1-3-5-14(6-4-2)12-10(15(17)18)7-9(23(13,21)22)8-11(12)16(19)20/h7-8H,3-6,13H2,1-2H3
41 atoms
S  -3.74715 -0.002225 -0.516588
O  -4.148346 1.309272 -0.994693
O  -4.069945 -1.195178 -1.280069
O  0.373649 -3.370433 -0.370585
O  1.64897 2.695881 -0.734553
O  1.334824 -2.501204 1.328574
O  0.121995 3.439819 0.557922
N  2.179119 0.061191 0.242821
N  0.654672 -2.429667 0.333668
N  0.666529 2.548631 -0.049777
N  -4.420077 -0.192033 0.96265
C  3.067998 -0.83289 -0.497699
C  2.827217 0.901001 1.244454
C  0.830581 0.049643 0.101386
C  2.660869 -1.122603 -1.936531
C  3.491075 0.087378 2.351101
C  0.069599 -1.137509 0.007218
C  0.050343 1.22837 0.007858
C  -1.9863 0.024377 -0.301069
C  -1.287065 -1.166868 -0.244313
C  -1.320391 1.227295 -0.146496
C  2.512646 0.111211 -2.811145
C  4.173345 1.006111 3.352578
H  3.262039 -1.768793 0.033511
H  4.027977 -0.311688 -0.529532
H  3.570227 1.543322 0.762996
H  2.089959 1.547509 1.721157
H  3.454052 -1.759492 -2.334821
H  1.753717 -1.726279 -2.002976
H  2.735391 -0.519901 2.853755
H  4.227147 -0.601289 1.930979
H  -1.797596 -2.118221 -0.321683
H  -1.854045 2.166494 -0.210715
H  3.374902 0.773593 -2.717201
H  2.43167 -0.178276 -3.859074
H  1.618533 0.68593 -2.570944
H  3.461448 1.691697 3.815736
H  4.64529 0.432579 4.15024
H  4.94978 1.607289 2.876196
H  -4.241341 0.578294 1.599979
H  -4.217989 -1.088299 1.395584
elementType: S O N C H
totalener: -1536.59568898 hartree
nucrepener: 2335.26985641 hartree
electener: -3871.86554540 hartree
oneelecener: -6744.22056601 hartree
twoeener: 2872.35502061 hartree
cpcmener: -0.05223211 hartree
kineticenergy: 1531.11975819 hartree
xcener: -123.982105765685 hartree
chargesum: -0.0000000
charge: 0.884983 -0.531911 -0.531283 -0.370800 -0.360552 -0.367008 -0.376146 -0.026091 0.558838 0.548180 -0.246191 -0.121984 -0.049829 -0.010818 -0.096819 -0.084987 -0.095875 -0.019521 -0.059166 -0.019434 -0.004355 -0.277055 -0.283596 0.116430 0.105331 0.101033 0.106590 0.083235 0.078870 0.064818 0.074399 0.147734 0.147860 0.086801 0.101619 0.080536 0.084545 0.093351 0.082739 0.192553 0.192976
qa: 0.8850 -0.5319 -0.5313 -0.3708 -0.3606 -0.3670 -0.3761 -0.0261 0.5588 0.5482 -0.2462 -0.1220 -0.0498 -0.0108 -0.0968 -0.0850 -0.0959 -0.0195 -0.0592 -0.0194 -0.0044 -0.2771 -0.2836 0.1164 0.1053 0.1010 0.1066 0.0832 0.0789 0.0648 0.0744 0.1477 0.1479 0.0868 0.1016 0.0805 0.0845 0.0934 0.0827 0.1926 0.1930
va: 5.8564 1.9553 1.9519 1.8659 1.8756 1.8683 1.8621 3.0432 4.0905 4.1031 3.0967 3.8918 3.8407 4.2751 3.8711 3.8532 3.9810 3.9266 3.9272 4.0855 4.0607 3.9233 3.9559 0.9951 0.9933 0.9992 0.9925 1.0128 1.0141 1.0201 1.0091 1.0316 1.0361 1.0018 1.0060 1.0043 1.0003 1.0032 1.0018 1.0098 1.0093
dispcorr: -0.024620980 hartree
energy: -1536.620309963494
dipole: 31.15164 -29.48322 1.66842 0.34818 -0.70498 -0.35680 6.15759 -3.93490 2.22269
magnitude: 2.80202 au
magnitude: 7.12216 debye
