program: Orca
programVersion: 5.0.2
elementType: S O O O O O O N N N N C C C C C C C C C C C C H H H H H H H H H H H H H H H H H H
charge: 0
multiplicity: 1
keywords: wb97x-d3
keywords: def2-TZVPP
keywords: def2/J RIJCOSX
keywords: DEFGRID2
keywords: scfconv7
keywords: smallprint printgap noloewdin
keywords: NOSOSCF
formula: C12H18N4O6S
InChI: InChI=1/C12H18N4O6S/c1-3-5-14(6-4-2)12-10(15(17)18)7-9(23(13,21)22)8-11(12)16(19)20/h7-8H,3-6,13H2,1-2H3
41 atoms
S  -3.925988 -0.001753 -0.223347
O  -4.296283 1.173176 -0.993346
O  -4.365428 -1.321163 -0.643186
O  1.331962 -2.789644 -0.580036
O  0.166362 3.155017 -1.253136
O  0.060944 -3.319661 1.054743
O  1.353066 2.751834 0.474914
N  2.040504 -0.065731 0.154778
N  0.48662 -2.533119 0.243108
N  0.546204 2.431051 -0.363199
N  -4.497372 0.222347 1.293475
C  2.889237 0.634057 -0.807879
C  2.717416 -0.891135 1.15403
C  0.690868 -0.048486 0.038777
C  3.880106 -0.293476 -1.505831
C  3.707587 -0.111684 2.012221
C  -0.112413 -1.205776 0.203619
C  -0.063125 1.111929 -0.2668
C  -2.156561 -0.031927 -0.137492
C  -1.490122 -1.204854 0.171067
C  -1.437896 1.119568 -0.391501
C  4.606402 0.449758 -2.617164
C  3.064808 0.899049 2.946351
H  3.43266 1.455217 -0.333453
H  2.255876 1.065243 -1.58425
H  1.970989 -1.312297 1.8294
H  3.240041 -1.725223 0.681264
H  4.611186 -0.682001 -0.794021
H  3.347342 -1.152808 -1.918478
H  4.241956 -0.860339 2.602055
H  4.465516 0.36964 1.389831
H  -2.030686 -2.132281 0.311294
H  -1.947195 2.043676 -0.629572
H  5.349079 -0.189787 -3.093444
H  3.913135 0.785163 -3.390013
H  5.12677 1.329581 -2.234995
H  2.56274 1.699051 2.406463
H  2.326294 0.42169 3.59301
H  3.814354 1.360687 3.589789
H  -4.290928 -0.541696 1.930167
H  -4.248871 1.119894 1.697952
elementType: S O N C H
totalener: -1536.59776292 hartree
nucrepener: 2312.53388287 hartree
electener: -3849.13164578 hartree
oneelecener: -6698.65586721 hartree
twoeener: 2849.52422143 hartree
cpcmener: -0.05231680 hartree
kineticenergy: 1531.11405635 hartree
xcener: -123.981808645360 hartree
chargesum: 0.0000000
charge: 0.885564 -0.533120 -0.532741 -0.367257 -0.377719 -0.375381 -0.363962 -0.060091 0.548477 0.549393 -0.247081 -0.100085 -0.115383 0.045936 -0.081526 -0.110789 -0.032740 -0.001307 -0.062481 -0.047756 -0.020605 -0.287863 -0.284494 0.112160 0.114288 0.119420 0.120299 0.071377 0.071527 0.080620 0.070848 0.147468 0.146115 0.094090 0.085560 0.084081 0.089802 0.083117 0.096349 0.193467 0.192425
qa: 0.8856 -0.5331 -0.5327 -0.3673 -0.3777 -0.3754 -0.3640 -0.0601 0.5485 0.5494 -0.2471 -0.1001 -0.1154 0.0459 -0.0815 -0.1108 -0.0327 -0.0013 -0.0625 -0.0478 -0.0206 -0.2879 -0.2845 0.1122 0.1143 0.1194 0.1203 0.0714 0.0715 0.0806 0.0708 0.1475 0.1461 0.0941 0.0856 0.0841 0.0898 0.0831 0.0963 0.1935 0.1924
va: 5.8566 1.9538 1.9486 1.8690 1.8649 1.8620 1.8607 3.0978 4.0887 4.0850 3.0941 3.8698 3.8840 4.2567 3.8533 3.8926 3.9577 3.9330 3.9200 4.1117 4.0592 3.9542 3.9324 0.9851 0.9891 0.9911 0.9916 1.0090 1.0183 1.0077 1.0071 1.0322 1.0369 1.0034 1.0004 1.0012 1.0063 1.0026 1.0048 1.0090 1.0096
dispcorr: -0.023632306 hartree
energy: -1536.621395223214
dipole: 35.98032 -33.97076 2.00955 2.69774 -2.53753 0.16021 5.85458 -3.49354 2.36104
magnitude: 3.10459 au
magnitude: 7.89124 debye
