program: Orca
programVersion: 5.0.2
elementType: S O O O O O O N N N N C C C C C C C C C C C C H H H H H H H H H H H H H H H H H H
charge: 0
multiplicity: 1
keywords: wb97x-d3
keywords: def2-TZVPP
keywords: def2/J RIJCOSX
keywords: DEFGRID2
keywords: scfconv7
keywords: smallprint printgap noloewdin
keywords: NOSOSCF
formula: C12H18N4O6S
InChI: InChI=1/C12H18N4O6S/c1-3-5-14(6-4-2)12-10(15(17)18)7-9(23(13,21)22)8-11(12)16(19)20/h7-8H,3-6,13H2,1-2H3
41 atoms
S  -3.801227 -0.066237 -0.196326
O  -4.240748 0.92393 -1.16397
O  -4.174756 -1.462083 -0.347252
O  0.350577 -2.977505 1.465291
O  0.178283 3.313245 -1.225104
O  1.504136 -2.766191 -0.320228
O  1.391156 2.834785 0.467698
N  2.173336 0.115286 -0.096972
N  0.703006 -2.363223 0.486645
N  0.584184 2.547352 -0.383646
N  -4.360567 0.418263 1.261623
C  2.903274 0.893287 -1.095863
C  2.98901 -0.451251 0.9792
C  0.816933 0.079151 -0.070032
C  3.873225 0.045592 -1.91176
C  2.444137 -0.184334 2.376999
C  0.065356 -1.077389 0.240837
C  0.008885 1.21006 -0.344634
C  -2.030069 -0.003867 -0.144205
C  -1.313207 -1.121438 0.242057
C  -1.366136 1.170894 -0.446864
C  3.191669 -0.915494 -2.870454
C  3.395656 -0.727673 3.43057
H  3.451869 1.703185 -0.607728
H  2.201128 1.341467 -1.80048
H  3.195813 -1.515029 0.837518
H  3.95893 0.042875 0.904285
H  4.492419 0.746501 -2.476915
H  4.559011 -0.491897 -1.252539
H  2.313696 0.892468 2.505352
H  1.460236 -0.633999 2.526126
H  -1.818521 -2.047728 0.48315
H  -1.913284 2.072213 -0.691693
H  3.926962 -1.46699 -3.45695
H  2.57588 -1.646316 -2.349571
H  2.547446 -0.380244 -3.570148
H  3.5240 -1.806448 3.329967
H  4.381714 -0.26726 3.353324
H  3.017987 -0.533705 4.434115
H  -4.123848 -0.206649 2.025933
H  -4.154455 1.386135 1.487925
elementType: S O N C H
totalener: -1536.59552071 hartree
nucrepener: 2330.71234933 hartree
electener: -3867.30787005 hartree
oneelecener: -6735.09043583 hartree
twoeener: 2867.78256579 hartree
cpcmener: -0.05098990 hartree
kineticenergy: 1531.12208998 hartree
xcener: -123.981657817057 hartree
chargesum: 0.0000000
charge: 0.884374 -0.531923 -0.531782 -0.366407 -0.376096 -0.363309 -0.365351 -0.032492 0.563215 0.542968 -0.244936 -0.084988 -0.122308 -0.012438 -0.109484 -0.046226 -0.056709 -0.021715 -0.064249 -0.018241 -0.013761 -0.284479 -0.287095 0.111982 0.113085 0.116164 0.100177 0.078230 0.070704 0.070977 0.069146 0.148880 0.146745 0.096255 0.088928 0.082187 0.084735 0.085405 0.095368 0.193083 0.191383
qa: 0.8844 -0.5319 -0.5318 -0.3664 -0.3761 -0.3633 -0.3654 -0.0325 0.5632 0.5430 -0.2449 -0.0850 -0.1223 -0.0124 -0.1095 -0.0462 -0.0567 -0.0217 -0.0642 -0.0182 -0.0138 -0.2845 -0.2871 0.1120 0.1131 0.1162 0.1002 0.0782 0.0707 0.0710 0.0691 0.1489 0.1467 0.0963 0.0889 0.0822 0.0847 0.0854 0.0954 0.1931 0.1914
va: 5.8603 1.9523 1.9535 1.8719 1.8616 1.8647 1.8727 3.0678 4.0902 4.1011 3.0976 3.8909 3.8747 4.2511 3.8933 3.8382 3.9586 3.9684 3.9216 4.0646 4.0741 3.9226 3.9588 1.0011 0.9904 0.9917 0.9974 1.0091 1.0074 1.0161 1.0151 1.0325 1.0326 1.0044 1.0100 1.0031 1.0013 1.0007 1.0028 1.0094 1.0103
dispcorr: -0.024323024 hartree
energy: -1536.619843738988
dipole: 31.57838 -29.70057 1.87781 -2.14147 2.91955 0.77808 5.13796 -3.15017 1.98779
magnitude: 2.84304 au
magnitude: 7.22644 debye
