program: Orca
programVersion: 5.0.2
elementType: S O O O O O O N N N N C C C C C C C C C C C C H H H H H H H H H H H H H H H H H H
charge: 0
multiplicity: 1
keywords: wb97x-d3
keywords: def2-TZVPP
keywords: def2/J RIJCOSX
keywords: DEFGRID2
keywords: scfconv7
keywords: smallprint printgap noloewdin
keywords: NOSOSCF
formula: C12H18N4O6S
InChI: InChI=1/C12H18N4O6S/c1-3-5-14(6-4-2)12-10(15(17)18)7-9(23(13,21)22)8-11(12)16(19)20/h7-8H,3-6,13H2,1-2H3
41 atoms
S  -3.766568 -0.003562 -0.466246
O  -4.172923 1.307012 -0.936478
O  -4.101316 -1.203456 -1.210286
O  0.386668 -3.365783 -0.425534
O  1.64091 2.688444 -0.752204
O  1.306408 -2.522248 1.309903
O  0.120049 3.433085 0.546979
N  2.172175 0.048642 0.226211
N  0.646234 -2.438963 0.303263
N  0.6597 2.543569 -0.066674
N  -4.405799 -0.185191 1.029405
C  3.058761 -0.857678 -0.503044
C  2.822855 0.896317 1.21969
C  0.82249 0.041954 0.083979
C  2.681589 -1.119623 -1.955795
C  3.472979 0.095132 2.343868
C  0.057955 -1.143173 -0.0071
C  0.043284 1.222416 -0.005569
C  -2.000897 0.02159 -0.284281
C  -1.301332 -1.170302 -0.242336
C  -1.329978 1.222792 -0.141495
C  2.610863 0.12719 -2.821819
C  4.130252 1.025001 3.352114
H  3.218168 -1.804167 0.021115
H  4.031739 -0.360445 -0.504976
H  3.57215 1.526651 0.731818
H  2.089859 1.556362 1.684066
H  3.457154 -1.787559 -2.338744
H  1.750827 -1.682595 -2.050954
H  2.712829 -0.514072 2.837802
H  4.221022 -0.592456 1.94277
H  -1.814047 -2.120633 -0.32236
H  -1.864008 2.162506 -0.200056
H  3.497711 0.751663 -2.69729
H  2.547506 -0.147914 -3.875477
H  1.736765 0.738011 -2.598996
H  3.405302 1.707911 3.799626
H  4.591433 0.459306 4.162159
H  4.911941 1.629985 2.888535
H  -4.232384 0.589917 1.661348
H  -4.212957 -1.081355 1.46492
elementType: S O N C H
totalener: -1536.59869969 hartree
nucrepener: 2333.41895883 hartree
electener: -3870.01765852 hartree
oneelecener: -6740.63862370 hartree
twoeener: 2870.62096518 hartree
cpcmener: -0.04344594 hartree
kineticenergy: 1531.11777199 hartree
xcener: -123.979062133961 hartree
chargesum: 0.0000000
charge: 0.876566 -0.516368 -0.516239 -0.357697 -0.348202 -0.356009 -0.366275 -0.023282 0.543193 0.534795 -0.247727 -0.126010 -0.053206 -0.006483 -0.097511 -0.083710 -0.094669 -0.022196 -0.061254 -0.028330 -0.014624 -0.272632 -0.280312 0.116669 0.103092 0.101055 0.103948 0.081872 0.078216 0.065023 0.072870 0.146764 0.147553 0.084012 0.100382 0.081477 0.083727 0.093200 0.082268 0.187995 0.188061
qa: 0.8766 -0.5164 -0.5162 -0.3577 -0.3482 -0.3560 -0.3663 -0.0233 0.5432 0.5348 -0.2477 -0.1260 -0.0532 -0.0065 -0.0975 -0.0837 -0.0947 -0.0222 -0.0613 -0.0283 -0.0146 -0.2726 -0.2803 0.1167 0.1031 0.1011 0.1039 0.0819 0.0782 0.0650 0.0729 0.1468 0.1476 0.0840 0.1004 0.0815 0.0837 0.0932 0.0823 0.1880 0.1881
va: 5.8784 1.9745 1.9707 1.8799 1.8874 1.8777 1.8716 3.0425 4.1121 4.1225 3.0981 3.8965 3.8478 4.2760 3.8740 3.8529 3.9725 3.9297 3.9292 4.0860 4.0615 3.9216 3.9551 0.9969 0.9931 0.9991 0.9928 1.0130 1.0146 1.0205 1.0094 1.0323 1.0373 1.0028 1.0057 1.0068 1.0007 1.0033 1.0020 1.0129 1.0125
dispcorr: -0.024536749 hartree
energy: -1536.623236436639
dipole: 31.37848 -29.74812 1.63036 0.47189 -0.81239 -0.34050 6.11851 -4.01048 2.10803
magnitude: 2.68660 au
magnitude: 6.82880 debye
