program: Orca
programVersion: 5.0.2
elementType: Cl Cl S P O O N C C C C C C C C C C H H H H H H H H H H H H H H
charge: 0
multiplicity: 1
keywords: wb97x-d3
keywords: def2-TZVPP
keywords: def2/J RIJCOSX
keywords: DEFGRID2
keywords: scfconv7
keywords: smallprint printgap noloewdin
keywords: NOSOSCF
formula: C10H14Cl2NO2PS
InChI: InChI=1/C10H14Cl2NO2PS/c1-7(2)13-16(17,14-3)15-10-5-4-8(11)6-9(10)12/h4-7,13H,1-3H3
31 atoms
Cl 0.231638 1.11638 -2.371564
Cl 4.605693 1.747354 0.675714
S  -1.434347 -1.869488 1.920719
P  -1.576425 -1.287547 0.090508
O  -0.173482 -1.3114 -0.768541
O  -2.288755 -2.28447 -0.941746
N  -2.297936 0.170793 -0.091354
C  -2.438421 1.201979 0.9418
C  -3.632499 2.073741 0.591667
C  -1.171392 2.025687 1.110052
C  0.918923 -0.58619 -0.393433
C  1.238287 0.580462 -1.079996
C  1.751082 -1.027089 0.623596
C  -3.617694 -2.737444 -0.668826
C  2.370939 1.308169 -0.754491
C  2.88776 -0.31168 0.960604
C  3.18355 0.851993 0.269838
H  -2.647166 0.683325 1.878443
H  -2.380696 0.516353 -1.041993
H  -3.782599 2.833688 1.358468
H  -3.477698 2.589379 -0.359028
H  -4.547302 1.485912 0.515472
H  -0.327585 1.399529 1.404552
H  -1.308669 2.781587 1.884679
H  -0.91057 2.539641 0.183092
H  1.516943 -1.943806 1.146511
H  -3.852014 -3.489617 -1.417325
H  -4.33733 -1.922147 -0.74451
H  -3.686584 -3.187907 0.322188
H  2.611531 2.212879 -1.29526
H  3.532669 -0.666974 1.751947
elementType: Cl S P O N C H
totalener: -2254.84493321 hartree
nucrepener: 1859.65399349 hartree
electener: -4114.49892671 hartree
oneelecener: -6804.12952823 hartree
twoeener: 2689.63060152 hartree
cpcmener: -0.02036853 hartree
kineticenergy: 2249.45550497 hartree
xcener: -135.993198786156 hartree
chargesum: 0.0000000
charge: -0.072614 -0.084861 -0.466358 0.679825 -0.360506 -0.354779 -0.265811 0.131065 -0.263016 -0.275224 0.237788 0.002708 -0.169427 -0.117071 -0.100172 -0.133042 0.064011 0.060709 0.165384 0.089348 0.090417 0.094367 0.077872 0.105623 0.083256 0.146749 0.130216 0.119650 0.102112 0.131883 0.149897
qa: -0.0726 -0.0849 -0.4664 0.6798 -0.3605 -0.3548 -0.2658 0.1311 -0.2630 -0.2752 0.2378 0.0027 -0.1694 -0.1171 -0.1002 -0.1330 0.0640 0.0607 0.1654 0.0893 0.0904 0.0944 0.0779 0.1056 0.0833 0.1467 0.1302 0.1196 0.1021 0.1319 0.1499
va: 1.2384 1.2156 1.9713 5.4732 2.0937 2.0870 3.1019 3.8365 3.9216 3.9148 3.7860 3.9565 3.9926 3.8568 3.9993 4.0000 3.8753 1.0322 1.0286 1.0047 1.0031 1.0098 1.0133 1.0121 1.0101 1.0128 0.9904 0.9928 1.0016 1.0154 1.0010
dispcorr: -0.018132454 hartree
energy: -2254.863065668445
dipole: -27.20622 25.96684 -1.23938 2.99157 -1.97642 1.01515 7.34125 -7.92780 -0.58654
magnitude: 1.70606 au
magnitude: 4.33646 debye
