program: Orca
programVersion: 5.0.2
elementType: Cl Cl S P O O N C C C C C C C C C C H H H H H H H H H H H H H H
charge: 0
multiplicity: 1
keywords: wb97x-d3
keywords: def2-TZVPP
keywords: def2/J RIJCOSX
keywords: DEFGRID2
keywords: scfconv7
keywords: smallprint printgap noloewdin
keywords: NOSOSCF
formula: C10H14Cl2NO2PS
InChI: InChI=1/C10H14Cl2NO2PS/c1-7(2)13-16(17,14-3)15-10-5-4-8(11)6-9(10)12/h4-7,13H,1-3H3
31 atoms
Cl 0.532726 0.491238 -2.666017
Cl 4.509428 1.77648 0.709394
S  -1.739971 -2.578232 1.804609
P  -1.816548 -1.176667 0.487143
O  -0.481625 -1.051753 -0.46541
O  -2.887736 -1.38097 -0.687001
N  -2.068369 0.318158 1.076758
C  -2.22211 1.545298 0.288242
C  -1.343843 2.63898 0.873809
C  -3.683204 1.961122 0.225217
C  0.659729 -0.397312 -0.12604
C  1.268206 0.375119 -1.112155
C  1.248279 -0.478234 1.127191
C  -2.891996 -2.56704 -1.488333
C  2.455286 1.042935 -0.865979
C  2.428217 0.198067 1.392853
C  3.02488 0.947225 0.392968
H  -1.875545 1.332054 -0.725197
H  -2.358714 0.375158 2.044041
H  -0.292091 2.351432 0.864396
H  -1.447695 3.559854 0.299932
H  -1.628865 2.85535 1.905561
H  -4.073322 2.158696 1.225761
H  -4.296587 1.184136 -0.23099
H  -3.798792 2.871037 -0.364039
H  0.796247 -1.080068 1.905085
H  -2.091025 -2.540884 -2.227181
H  -3.849819 -2.599663 -2.000972
H  -2.788075 -3.461304 -0.872696
H  2.920327 1.630417 -1.645534
H  2.874469 0.128315 2.374894
elementType: Cl S P O N C H
totalener: -2254.84616460 hartree
nucrepener: 1850.19729047 hartree
electener: -4105.04345507 hartree
oneelecener: -6784.93117479 hartree
twoeener: 2679.88771971 hartree
cpcmener: -0.01965369 hartree
kineticenergy: 2249.44164506 hartree
xcener: -135.991177579773 hartree
chargesum: 0.0000000
charge: -0.073191 -0.087604 -0.458604 0.613467 -0.343948 -0.341817 -0.217397 0.111422 -0.261664 -0.271931 0.239727 0.009517 -0.175877 -0.102110 -0.094671 -0.134793 0.057469 0.062524 0.164189 0.081362 0.093945 0.095910 0.091944 0.089885 0.091962 0.138297 0.116126 0.126793 0.100147 0.130314 0.148606
qa: -0.0732 -0.0876 -0.4586 0.6135 -0.3439 -0.3418 -0.2174 0.1114 -0.2617 -0.2719 0.2397 0.0095 -0.1759 -0.1021 -0.0947 -0.1348 0.0575 0.0625 0.1642 0.0814 0.0939 0.0959 0.0919 0.0899 0.0920 0.1383 0.1161 0.1268 0.1001 0.1303 0.1486
va: 1.2367 1.2125 1.9950 5.4921 2.0912 2.0759 3.0824 3.8250 3.9233 3.9515 3.7992 3.9093 3.9478 3.8408 4.0064 4.0157 3.8780 1.0248 1.0237 1.0072 1.0069 1.0051 1.0040 1.0135 1.0055 1.0299 0.9943 0.9888 1.0076 1.0165 1.0017
dispcorr: -0.017932827 hartree
energy: -2254.864097429601
dipole: -24.89093 24.22473 -0.66620 6.30371 -4.96003 1.34368 4.17898 -4.51362 -0.33464
magnitude: 1.53664 au
magnitude: 3.90583 debye
