program: Orca
programVersion: 5.0.2
elementType: Cl Cl S P O O N C C C C C C C C C C H H H H H H H H H H H H H H
charge: 0
multiplicity: 1
keywords: wb97x-d3
keywords: def2-TZVPP
keywords: def2/J RIJCOSX
keywords: DEFGRID2
keywords: scfconv7
keywords: smallprint printgap noloewdin
keywords: NOSOSCF
formula: C10H14Cl2NO2PS
InChI: InChI=1/C10H14Cl2NO2PS/c1-7(2)13-16(17,14-3)15-10-5-4-8(11)6-9(10)12/h4-7,13H,1-3H3
31 atoms
Cl 0.462273 1.882894 -1.532125
Cl 5.267108 -0.216203 -0.382585
S  -1.475053 -2.291946 1.700918
P  -1.571439 -0.741804 0.561133
O  -0.428407 0.403487 0.828176
O  -1.257847 -0.987354 -0.993299
N  -2.975764 0.079512 0.661472
C  -3.299011 1.315846 -0.057078
C  -3.134185 2.531264 0.84284
C  -4.708951 1.218506 -0.61612
C  0.891306 0.210244 0.537831
C  1.450775 0.872823 -0.549489
C  1.695115 -0.585203 1.338807
C  -1.980692 -1.990999 -1.709882
C  2.79971 0.749638 -0.837244
C  3.044977 -0.722347 1.061323
C  3.583287 -0.054998 -0.026532
H  -2.602989 1.401075 -0.893364
H  -3.55648 -0.12374 1.464084
H  -3.371448 3.44575 0.299388
H  -3.804072 2.469763 1.702527
H  -2.113427 2.617684 1.214065
H  -5.438579 1.104062 0.18779
H  -4.809144 0.368439 -1.291104
H  -4.963428 2.121896 -1.169858
H  1.266458 -1.087852 2.19482
H  -3.024635 -1.70496 -1.838857
H  -1.931058 -2.954183 -1.200558
H  -1.511999 -2.079914 -2.686091
H  3.226036 1.271876 -1.682452
H  3.664597 -1.343914 1.692387
elementType: Cl S P O N C H
totalener: -2254.84702957 hartree
nucrepener: 1838.88098257 hartree
electener: -4093.72801214 hartree
oneelecener: -6762.94728220 hartree
twoeener: 2669.21927007 hartree
cpcmener: -0.01972714 hartree
kineticenergy: 2249.46222527 hartree
xcener: -135.992364032336 hartree
chargesum: 0.0000000
charge: -0.067633 -0.085690 -0.461769 0.608164 -0.358660 -0.327942 -0.225943 0.097096 -0.270007 -0.263811 0.272307 -0.010483 -0.187296 -0.102066 -0.093096 -0.129333 0.054188 0.068985 0.162143 0.091780 0.091524 0.086671 0.092269 0.092150 0.089420 0.153123 0.114644 0.104083 0.125749 0.131456 0.147976
qa: -0.0676 -0.0857 -0.4618 0.6082 -0.3587 -0.3279 -0.2259 0.0971 -0.2700 -0.2638 0.2723 -0.0105 -0.1873 -0.1021 -0.0931 -0.1293 0.0542 0.0690 0.1621 0.0918 0.0915 0.0867 0.0923 0.0921 0.0894 0.1531 0.1146 0.1041 0.1257 0.1315 0.1480
va: 1.2448 1.2150 2.0055 5.5212 2.0753 2.0509 3.0929 3.8491 3.9328 3.9498 3.7251 3.9971 4.0314 3.8427 3.9852 4.0134 3.8769 1.0204 1.0254 1.0062 1.0054 1.0168 1.0036 1.0055 1.0055 1.0114 0.9888 1.0074 0.9904 1.0149 1.0017
dispcorr: -0.016926014 hartree
energy: -2254.863955584170
dipole: -33.87187 32.39366 -1.47821 3.57243 -2.78239 0.79004 -0.11960 -0.66846 -0.78806
magnitude: 1.85211 au
magnitude: 4.70768 debye
