program: Orca
programVersion: 5.0.2
elementType: Cl Cl S P O O N C C C C C C C C C C H H H H H H H H H H H H H H
charge: 0
multiplicity: 1
keywords: wb97x-d3
keywords: def2-TZVPP
keywords: def2/J RIJCOSX
keywords: DEFGRID2
keywords: scfconv7
keywords: smallprint printgap noloewdin
keywords: NOSOSCF
formula: C10H14Cl2NO2PS
InChI: InChI=1/C10H14Cl2NO2PS/c1-7(2)13-16(17,14-3)15-10-5-4-8(11)6-9(10)12/h4-7,13H,1-3H3
31 atoms
Cl 0.867716 2.740917 -0.275576
Cl 5.273887 -0.314928 -0.600307
S  -1.544304 -1.942658 2.107655
P  -1.658113 -0.806313 0.557197
O  -0.464641 0.305652 0.403638
O  -1.446979 -1.511545 -0.866556
N  -3.018451 0.085792 0.479517
C  -3.345911 1.07974 -0.547264
C  -3.232604 2.488066 0.015575
C  -4.735646 0.805247 -1.099721
C  0.852958 0.080253 0.166843
C  1.622863 1.195098 -0.161937
C  1.472143 -1.159714 0.251829
C  -2.251025 -2.636228 -1.232618
C  2.981765 1.084308 -0.398835
C  2.830884 -1.284314 0.012471
C  3.576143 -0.163574 -0.308789
H  -2.62371 0.966312 -1.358168
H  -3.569748 0.129195 1.326535
H  -3.470999 3.227021 -0.749779
H  -3.928577 2.629897 0.844949
H  -2.2253 2.691692 0.378387
H  -5.486213 0.863036 -0.308601
H  -4.793072 -0.185768 -1.550818
H  -4.997489 1.539778 -1.861472
H  0.911713 -2.044279 0.520685
H  -2.231056 -3.405376 -0.459504
H  -1.827924 -3.041961 -2.147877
H  -3.282618 -2.335007 -1.416281
H  3.561991 1.961397 -0.650497
H  3.295924 -2.257561 0.082823
elementType: Cl S P O N C H
totalener: -2254.84654406 hartree
nucrepener: 1815.42377059 hartree
electener: -4070.27031465 hartree
oneelecener: -6715.76943846 hartree
twoeener: 2645.49912381 hartree
cpcmener: -0.02064936 hartree
kineticenergy: 2249.44165068 hartree
xcener: -135.991099288712 hartree
chargesum: -0.0000000
charge: -0.072554 -0.088767 -0.459868 0.615146 -0.317795 -0.338802 -0.230724 0.104071 -0.266920 -0.264697 0.297365 -0.028831 -0.174602 -0.099840 -0.093826 -0.151950 0.047538 0.069490 0.164119 0.091694 0.092908 0.078475 0.089848 0.092557 0.090066 0.127245 0.104618 0.128354 0.116556 0.131183 0.147941
qa: -0.0726 -0.0888 -0.4599 0.6151 -0.3178 -0.3388 -0.2307 0.1041 -0.2669 -0.2647 0.2974 -0.0288 -0.1746 -0.0998 -0.0938 -0.1520 0.0475 0.0695 0.1641 0.0917 0.0929 0.0785 0.0898 0.0926 0.0901 0.1272 0.1046 0.1284 0.1166 0.1312 0.1479
va: 1.2405 1.2124 1.9952 5.5174 2.1392 2.0335 3.1286 3.8414 3.9346 3.9498 3.7534 3.9610 3.9468 3.8326 3.9871 4.0490 3.8824 1.0215 1.0248 1.0058 1.0056 1.0196 1.0041 1.0045 1.0055 1.0394 1.0090 0.9901 0.9897 1.0156 1.0024
dispcorr: -0.016433846 hartree
energy: -2254.862977904692
dipole: -35.84814 34.04332 -1.80482 -1.78247 1.87371 0.09124 -6.46574 5.02166 -1.44408
magnitude: 2.31324 au
magnitude: 5.87979 debye
