program: Orca
programVersion: 5.0.2
elementType: Cl Cl S P O O N C C C C C C C C C C H H H H H H H H H H H H H H
charge: 0
multiplicity: 1
keywords: wb97x-d3
keywords: def2-TZVPP
keywords: def2/J RIJCOSX
keywords: DEFGRID2
keywords: scfconv7
keywords: smallprint printgap noloewdin
keywords: NOSOSCF
formula: C10H14Cl2NO2PS
InChI: InChI=1/C10H14Cl2NO2PS/c1-7(2)13-16(17,14-3)15-10-5-4-8(11)6-9(10)12/h4-7,13H,1-3H3
31 atoms
Cl 0.442551 1.253971 -2.315626
Cl 4.941674 1.109753 0.606116
S  -1.506144 -1.512519 1.986566
P  -1.645283 -0.943564 0.152199
O  -0.29314 -1.133684 -0.765178
O  -2.632775 -1.806477 -0.77017
N  -2.040995 0.630052 -0.063743
C  -2.901364 1.397977 0.845294
C  -4.373028 1.070395 0.650525
C  -2.618311 2.876634 0.643146
C  0.912707 -0.600159 -0.410945
C  1.384999 0.530349 -1.068574
C  1.703178 -1.206673 0.553081
C  -2.582516 -3.236172 -0.78121
C  2.626981 1.062646 -0.761722
C  2.946866 -0.687609 0.871088
C  3.391602 0.448778 0.215757
H  -2.60753 1.124439 1.859788
H  -2.089248 0.941101 -1.028951
H  -4.693561 1.299106 -0.367678
H  -4.574786 0.015495 0.84149
H  -4.989592 1.65396 1.335468
H  -1.567752 3.108157 0.818395
H  -3.21394 3.471237 1.335796
H  -2.873572 3.193935 -0.370432
H  1.350551 -2.101234 1.046745
H  -1.699724 -3.592609 -1.31165
H  -3.473616 -3.578751 -1.299837
H  -2.581827 -3.639579 0.231701
H  2.98556 1.941029 -1.279796
H  3.556676 -1.171325 1.620919
elementType: Cl S P O N C H
totalener: -2254.84505450 hartree
nucrepener: 1833.84971433 hartree
electener: -4088.69476883 hartree
oneelecener: -6752.80081509 hartree
twoeener: 2664.10604626 hartree
cpcmener: -0.01826428 hartree
kineticenergy: 2249.44739683 hartree
xcener: -135.989005544518 hartree
chargesum: 0.0000000
charge: -0.072085 -0.085833 -0.468102 0.707923 -0.373059 -0.357003 -0.262414 0.096673 -0.260095 -0.268760 0.287613 -0.029631 -0.195611 -0.107121 -0.088690 -0.126060 0.052814 0.066982 0.159511 0.089258 0.082030 0.091682 0.091755 0.091656 0.090964 0.151185 0.122782 0.129853 0.100142 0.131347 0.150296
qa: -0.0721 -0.0858 -0.4681 0.7079 -0.3731 -0.3570 -0.2624 0.0967 -0.2601 -0.2688 0.2876 -0.0296 -0.1956 -0.1071 -0.0887 -0.1261 0.0528 0.0670 0.1595 0.0893 0.0820 0.0917 0.0918 0.0917 0.0910 0.1512 0.1228 0.1299 0.1001 0.1313 0.1503
va: 1.2398 1.2149 1.9724 5.4512 2.0872 2.0751 3.1624 3.8750 3.9154 3.9232 3.7511 4.0122 4.0042 3.8355 3.9933 3.9882 3.8824 1.0310 1.0335 1.0053 1.0175 1.0084 1.0102 1.0054 1.0026 1.0126 0.9905 0.9886 1.0070 1.0146 1.0009
dispcorr: -0.016258906 hartree
energy: -2254.861313408616
dipole: -30.46497 29.73595 -0.72902 0.46519 -0.31412 0.15106 5.45346 -6.32574 -0.87229
magnitude: 1.14681 au
magnitude: 2.91497 debye
