program: Orca
programVersion: 5.0.2
elementType: Cl Cl S P O O N C C C C C C C C C C H H H H H H H H H H H H H H
charge: 0
multiplicity: 1
keywords: wb97x-d3
keywords: def2-TZVPP
keywords: def2/J RIJCOSX
keywords: DEFGRID2
keywords: scfconv7
keywords: smallprint printgap noloewdin
keywords: NOSOSCF
formula: C10H14Cl2NO2PS
InChI: InChI=1/C10H14Cl2NO2PS/c1-7(2)13-16(17,14-3)15-10-5-4-8(11)6-9(10)12/h4-7,13H,1-3H3
31 atoms
Cl 1.392544 -2.574274 0.584831
Cl 4.912505 1.445697 0.038744
S  -1.34867 0.051417 1.902998
P  -1.729685 -0.33644 0.059049
O  -0.42811 -0.785727 -0.839065
O  -2.661848 -1.605566 -0.236552
N  -2.373076 0.897214 -0.809508
C  -3.307644 1.883886 -0.260528
C  -4.717474 1.327297 -0.123605
C  -3.271947 3.121852 -1.140856
C  0.800357 -0.239742 -0.62475
C  1.770651 -0.987519 0.034226
C  1.111705 1.032861 -1.076321
C  -2.411675 -2.876603 0.367785
C  3.042478 -0.4776 0.236741
C  2.377672 1.558481 -0.878794
C  3.329848 0.798653 -0.218976
H  -2.934986 2.149724 0.73046
H  -2.495587 0.717554 -1.8010
H  -4.745745 0.473545 0.555311
H  -5.394747 2.084845 0.27352
H  -5.107886 1.003921 -1.090893
H  -3.615304 2.896665 -2.153503
H  -2.263501 3.531642 -1.207353
H  -3.92443 3.895789 -0.736425
H  0.360726 1.615686 -1.593561
H  -1.625566 -3.410971 -0.165152
H  -3.336101 -3.445902 0.302471
H  -2.134486 -2.773527 1.417905
H  3.790282 -1.067173 0.74924
H  2.611766 2.551833 -1.235823
elementType: Cl S P O N C H
totalener: -2254.85757967 hartree
nucrepener: 1831.57706201 hartree
electener: -4086.43464167 hartree
oneelecener: -6748.44095157 hartree
twoeener: 2662.00630990 hartree
cpcmener: -0.01879310 hartree
kineticenergy: 2249.45077121 hartree
xcener: -135.989401607920 hartree
chargesum: 0.0000000
charge: -0.065321 -0.084416 -0.454767 0.687128 -0.368470 -0.348774 -0.247591 0.095384 -0.258719 -0.266435 0.208133 0.025542 -0.154511 -0.107805 -0.110935 -0.145680 0.071733 0.064935 0.152512 0.084430 0.090402 0.086376 0.089482 0.093566 0.090246 0.154819 0.112240 0.129786 0.101160 0.130077 0.145475
qa: -0.0653 -0.0844 -0.4548 0.6871 -0.3685 -0.3488 -0.2476 0.0954 -0.2587 -0.2664 0.2081 0.0255 -0.1545 -0.1078 -0.1109 -0.1457 0.0717 0.0649 0.1525 0.0844 0.0904 0.0864 0.0895 0.0936 0.0902 0.1548 0.1122 0.1298 0.1012 0.1301 0.1455
va: 1.2442 1.2161 1.9822 5.4639 2.0879 2.0870 3.1515 3.8760 3.9112 3.9277 3.8020 3.9833 4.0002 3.8376 4.0189 4.0101 3.8688 1.0318 1.0302 1.0170 1.0087 1.0067 1.0027 1.0083 1.0059 1.0070 0.9962 0.9911 1.0077 1.0157 1.0029
dispcorr: -0.016609271 hartree
energy: -2254.874188935823
dipole: -35.77600 34.54696 -1.22904 11.44853 -11.06399 0.38454 -6.73859 5.07618 -1.66241
magnitude: 2.10286 au
magnitude: 5.34505 debye
