program: Orca
programVersion: 5.0.2
elementType: Cl Cl S P O O N C C C C C C C C C C H H H H H H H H H H H H H H
charge: 0
multiplicity: 1
keywords: wb97x-d3
keywords: def2-TZVPP
keywords: def2/J RIJCOSX
keywords: DEFGRID2
keywords: scfconv7
keywords: smallprint printgap noloewdin
keywords: NOSOSCF
formula: C10H14Cl2NO2PS
InChI: InChI=1/C10H14Cl2NO2PS/c1-7(2)13-16(17,14-3)15-10-5-4-8(11)6-9(10)12/h4-7,13H,1-3H3
31 atoms
Cl 0.744826 0.799779 -2.536173
Cl 5.312409 -0.223867 0.093446
S  -1.713807 -1.048949 2.167427
P  -1.563886 -0.383201 0.376232
O  -0.452919 0.790369 0.130474
O  -1.029754 -1.418228 -0.72952
N  -2.936055 0.269539 -0.253174
C  -4.07694 0.75406 0.520574
C  -5.359813 0.4775 -0.249855
C  -3.930613 2.226873 0.880695
C  0.882909 0.518707 0.140409
C  1.581728 0.513139 -1.061661
C  1.560346 0.283435 1.325981
C  -1.608042 -2.71293 -0.809967
C  2.948308 0.290962 -1.08003
C  2.925414 0.051304 1.318792
C  3.609295 0.056907 0.114422
H  -4.091022 0.169228 1.441643
H  -2.843493 0.677538 -1.174808
H  -5.388248 1.032557 -1.190604
H  -5.458436 -0.583055 -0.47839
H  -6.229375 0.781468 0.332715
H  -3.027193 2.39661 1.466445
H  -4.781909 2.569583 1.469643
H  -3.874971 2.850072 -0.014605
H  1.009748 0.284617 2.256823
H  -1.493958 -3.253959 0.130196
H  -1.083286 -3.243837 -1.600322
H  -2.669322 -2.657837 -1.0614
H  3.485341 0.293643 -2.017582
H  3.450096 -0.132931 2.245409
totalener: -2254.83939893 hartree
nucrepener: 1822.53535279 hartree
electener: -4077.37475171 hartree
oneelecener: -6729.89297368 hartree
twoeener: 2652.51822197 hartree
kineticenergy: 2249.50067744 hartree
xcener: -135.998814672076 hartree
chargesum: 0.0000000
charge: -0.064579 -0.071018 -0.393321 0.637104 -0.346889 -0.310310 -0.243772 0.066867 -0.239240 -0.225881 0.238081 0.007021 -0.146027 -0.125998 -0.101832 -0.122815 0.053802 0.067094 0.122156 0.074635 0.092524 0.082200 0.093617 0.079621 0.072840 0.136421 0.111288 0.116410 0.101243 0.114585 0.124172
qa: -0.0646 -0.0710 -0.3933 0.6371 -0.3469 -0.3103 -0.2438 0.0669 -0.2392 -0.2259 0.2381 0.0070 -0.1460 -0.1260 -0.1018 -0.1228 0.0538 0.0671 0.1222 0.0746 0.0925 0.0822 0.0936 0.0796 0.0728 0.1364 0.1113 0.1164 0.1012 0.1146 0.1242
va: 1.2465 1.2308 2.0533 5.4922 2.1297 2.0985 3.1083 3.9114 3.9281 3.9173 3.8586 3.9958 4.0330 3.8904 4.0156 4.0298 3.9378 1.0374 1.0501 1.0066 1.0113 1.0087 1.0161 1.0105 1.0100 1.0172 1.0018 0.9911 0.9926 1.0206 1.0103
dispcorr: -0.015827852 hartree
energy: -2254.855226779083
dipole: -37.54434 36.52932 -1.01502 0.72107 -0.69643 0.02464 4.67163 -5.32345 -0.65182
magnitude: 1.20654 au
magnitude: 3.06679 debye
