program: Orca
programVersion: 5.0.2
elementType: Cl Cl S P O O N C C C C C C C C C C H H H H H H H H H H H H H H
charge: 0
multiplicity: 1
keywords: wb97x-d3
keywords: def2-TZVPP
keywords: def2/J RIJCOSX
keywords: DEFGRID2
keywords: scfconv7
keywords: smallprint printgap noloewdin
keywords: NOSOSCF
formula: C10H14Cl2NO2PS
InChI: InChI=1/C10H14Cl2NO2PS/c1-7(2)13-16(17,14-3)15-10-5-4-8(11)6-9(10)12/h4-7,13H,1-3H3
31 atoms
Cl 0.379352 0.903883 -2.535405
Cl 4.666646 1.490095 0.637649
S  -1.678264 -1.714657 1.919471
P  -1.690277 -1.091342 0.105383
O  -0.293276 -1.30494 -0.734744
O  -2.66141 -1.864384 -0.907695
N  -2.018493 0.502251 -0.097922
C  -2.737958 1.329995 0.868197
C  -4.24571 1.142953 0.765696
C  -2.319264 2.779192 0.675891
C  0.844799 -0.65089 -0.378818
C  1.288926 0.414096 -1.155654
C  1.594594 -1.044372 0.719537
C  -2.664277 -3.285325 -0.973816
C  2.466799 1.074765 -0.850455
C  2.771708 -0.388969 1.039147
C  3.198949 0.668194 0.252564
H  -2.411823 1.002281 1.856796
H  -2.022696 0.843787 -1.050387
H  -4.612319 1.420946 -0.224589
H  -4.520506 0.103929 0.948822
H  -4.766106 1.75931 1.499839
H  -1.239935 2.890737 0.773431
H  -2.796762 3.415183 1.42104
H  -2.613818 3.153093 -0.307792
H  1.248696 -1.87033 1.325143
H  -1.759792 -3.65952 -1.455654
H  -3.527694 -3.572664 -1.568914
H  -2.749738 -3.725197 0.021101
H  2.803664 1.897319 -1.464755
H  3.350653 -0.700862 1.896731
totalener: -2254.84054253 hartree
nucrepener: 1842.58727868 hartree
electener: -4097.42782122 hartree
oneelecener: -6769.81521473 hartree
twoeener: 2672.38739351 hartree
kineticenergy: 2249.49516876 hartree
xcener: -135.999072145372 hartree
chargesum: 0.0000000
charge: -0.071138 -0.068465 -0.398346 0.650862 -0.346765 -0.320788 -0.248373 0.058098 -0.223370 -0.245751 0.251954 -0.020279 -0.136168 -0.123819 -0.100490 -0.125922 0.053505 0.069452 0.133846 0.073459 0.089807 0.079454 0.099364 0.083192 0.074076 0.134701 0.114825 0.116493 0.104673 0.116880 0.125036
qa: -0.0711 -0.0685 -0.3983 0.6509 -0.3468 -0.3208 -0.2484 0.0581 -0.2234 -0.2458 0.2520 -0.0203 -0.1362 -0.1238 -0.1005 -0.1259 0.0535 0.0695 0.1338 0.0735 0.0898 0.0795 0.0994 0.0832 0.0741 0.1347 0.1148 0.1165 0.1047 0.1169 0.1250
va: 1.2426 1.2334 2.0403 5.4886 2.1108 2.1126 3.1185 3.9282 3.9106 3.9252 3.8474 3.9907 4.0153 3.8646 4.0156 4.0304 3.9500 1.0310 1.0567 1.0098 1.0201 1.0112 1.0093 1.0088 1.0064 1.0204 0.9898 0.9902 1.0071 1.0202 1.0100
dispcorr: -0.016459343 hartree
energy: -2254.857001875975
dipole: -28.50420 28.00895 -0.49525 1.15414 -0.95901 0.19513 6.26910 -6.77293 -0.50383
magnitude: 0.73294 au
magnitude: 1.86298 debye
