program: Orca
programVersion: 5.0.2
elementType: O O O O N N N C C C C C C C C C C C C C C H H H H H H H H H H H H H H H H H H H H H
charge: 0
multiplicity: 1
keywords: wb97x-d3
keywords: def2-TZVPP
keywords: def2/J RIJCOSX
keywords: DEFGRID2
keywords: scfconv7
keywords: smallprint printgap noloewdin
keywords: NOSOSCF
formula: C14H21N3O4
InChI: InChI=1/C14H21N3O4/c1-6-9(2)15-13-11(16(18)19)7-10(14(3,4)5)8-12(13)17(20)21/h7-9,15H,6H2,1-5H3
42 atoms
O  -0.584825 3.647047 0.562761
O  1.220418 -2.337535 1.626332
O  1.171334 2.883849 1.488878
O  0.754299 -3.024555 -0.343842
N  1.961125 0.423995 0.859877
N  0.129685 2.720526 0.876276
N  0.734611 -2.18752 0.528655
C  -3.555805 -0.171307 -0.71801
C  -2.109595 0.018843 -0.282238
C  -4.308792 -0.902038 0.399649
C  -3.6071 -1.007221 -2.00035
C  -4.245831 1.163892 -0.988804
C  3.0611 -0.328646 0.240747
C  0.646649 0.298172 0.587925
C  -1.590095 1.234297 0.108431
C  -1.253014 -1.075806 -0.183909
C  -0.268588 1.385416 0.527679
C  0.039307 -0.941605 0.271247
C  2.94209 -0.372819 -1.286166
C  4.353216 0.337555 0.684958
C  3.870567 -1.400682 -1.91416
H  3.08917 -1.348821 0.626045
H  -3.867074 -1.876422 0.615712
H  -4.304083 -0.320407 1.323092
H  -5.349421 -1.067462 0.113221
H  -4.642404 -1.127772 -2.32432
H  -3.057358 -0.527261 -2.811765
H  -3.196748 -2.008584 -1.862905
H  -5.262261 0.983179 -1.341125
H  -4.324238 1.783091 -0.093759
H  -3.729612 1.741162 -1.758029
H  -2.217769 2.112336 0.09587
H  -1.619147 -2.069776 -0.408162
H  2.226806 1.351125 1.154806
H  3.150869 0.624497 -1.683547
H  1.917863 -0.608485 -1.586079
H  5.213315 -0.20452 0.296135
H  4.411635 1.365558 0.32124
H  4.439286 0.34956 1.771642
H  3.646169 -2.404464 -1.548068
H  3.753571 -1.412868 -2.997776
H  4.920691 -1.1970 -1.703967
elementType: O N C H
totalener: -1011.21711425 hartree
nucrepener: 1819.20331143 hartree
electener: -2830.42042567 hartree
oneelecener: -4989.17415368 hartree
twoeener: 2158.75372801 hartree
cpcmener: -0.02714737 hartree
kineticenergy: 1007.00858993 hartree
xcener: -95.922557185550 hartree
chargesum: 0.0000000
charge: -0.415200 -0.378567 -0.415253 -0.379136 -0.222778 0.555575 0.556923 0.289971 -0.142911 -0.322675 -0.329021 -0.353204 0.081986 0.056096 0.020185 -0.027710 -0.031786 -0.076791 -0.085590 -0.301283 -0.284903 0.078216 0.099457 0.103608 0.100021 0.099794 0.105571 0.098958 0.103101 0.098591 0.113805 0.145378 0.146926 0.189738 0.076485 0.081644 0.100772 0.092595 0.108737 0.081351 0.096137 0.085187
qa: -0.4152 -0.3786 -0.4153 -0.3791 -0.2228 0.5556 0.5569 0.2900 -0.1429 -0.3227 -0.3290 -0.3532 0.0820 0.0561 0.0202 -0.0277 -0.0318 -0.0768 -0.0856 -0.3013 -0.2849 0.0782 0.0995 0.1036 0.1000 0.0998 0.1056 0.0990 0.1031 0.0986 0.1138 0.1454 0.1469 0.1897 0.0765 0.0816 0.1008 0.0926 0.1087 0.0814 0.0961 0.0852
va: 1.8457 1.8549 1.8143 1.8618 3.2215 4.0708 4.0928 3.6822 3.9372 3.9172 3.9095 3.9246 3.8430 4.1809 3.9019 4.0649 3.9818 3.9488 3.8090 3.9360 3.9498 1.0107 1.0028 1.0045 1.0029 1.0027 1.0025 1.0045 1.0053 1.0014 1.0000 1.0293 1.0152 1.0328 1.0119 1.0139 1.0019 1.0052 1.0058 1.0045 1.0025 1.0015
dispcorr: -0.021627031 hartree
energy: -1011.238741276317
dipole: -4.67394 3.86455 -0.80939 -5.81521 5.41581 -0.39941 -13.98944 12.79392 -1.19552
magnitude: 1.49797 au
magnitude: 3.80754 debye
