program: Orca
programVersion: 5.0.2
elementType: O O O O N N N C C C C C C C C C C C C C C H H H H H H H H H H H H H H H H H H H H H
charge: 0
multiplicity: 1
keywords: wb97x-d3
keywords: def2-TZVPP
keywords: def2/J RIJCOSX
keywords: DEFGRID2
keywords: scfconv7
keywords: smallprint printgap noloewdin
keywords: NOSOSCF
formula: C14H21N3O4
InChI: InChI=1/C14H21N3O4/c1-6-9(2)15-13-11(16(18)19)7-10(14(3,4)5)8-12(13)17(20)21/h7-9,15H,6H2,1-5H3
42 atoms
O  -0.67133 3.581563 0.242546
O  0.499809 -3.186136 -0.030014
O  1.240983 3.010497 -0.491363
O  1.510824 -2.105533 -1.56902
N  1.951794 0.448395 -0.310347
N  0.109406 2.735949 -0.133626
N  0.733331 -2.170805 -0.645128
C  -3.762322 -0.272875 0.123636
C  -2.254454 -0.106143 -0.011867
C  -4.450347 0.358948 -1.091808
C  -4.235051 0.43017 1.40104
C  -4.166536 -1.743218 0.202583
C  2.921346 -0.336048 0.466176
C  0.611725 0.290445 -0.268348
C  -1.691154 1.156021 -0.053781
C  -1.37478 -1.17326 -0.133012
C  -0.321046 1.362412 -0.165425
C  -0.01611 -0.97693 -0.297788
C  4.176634 -0.56005 -0.370802
C  3.209528 0.395279 1.772098
C  5.193976 -1.473331 0.29553
H  2.492609 -1.302341 0.730266
H  -4.231707 1.42443 -1.178602
H  -4.137587 -0.124203 -2.019033
H  -5.5338 0.253339 -1.009445
H  -5.315139 0.318297 1.512899
H  -3.760999 0.004557 2.287041
H  -4.019479 1.499578 1.387071
H  -5.248624 -1.816768 0.317914
H  -3.900781 -2.294992 -0.701078
H  -3.712679 -2.249727 1.056643
H  -2.334348 2.022849 0.00523
H  -1.75119 -2.18639 -0.160189
H  2.238062 1.413214 -0.395356
H  4.63367 0.410747 -0.587177
H  3.889519 -0.986876 -1.333207
H  3.670119 1.367358 1.584286
H  2.291293 0.555656 2.338165
H  3.886837 -0.181127 2.401669
H  4.752118 -2.439182 0.547735
H  6.033299 -1.662536 -0.373787
H  5.601936 -1.045267 1.211305
elementType: O N C H
totalener: -1011.21680525 hartree
nucrepener: 1803.46358025 hartree
electener: -2814.68038550 hartree
oneelecener: -4957.72716731 hartree
twoeener: 2143.04678181 hartree
cpcmener: -0.02773295 hartree
kineticenergy: 1007.00386079 hartree
xcener: -95.919457002566 hartree
chargesum: 0.0000000
charge: -0.410863 -0.388033 -0.409088 -0.377115 -0.229892 0.559086 0.531293 0.313797 -0.162589 -0.326403 -0.328336 -0.363229 0.101044 0.040213 0.012112 -0.012990 -0.076118 0.012508 -0.079061 -0.311339 -0.287840 0.086531 0.099418 0.105083 0.099160 0.099282 0.105568 0.098687 0.102756 0.104286 0.108878 0.143368 0.148865 0.186415 0.075496 0.070021 0.093898 0.102153 0.098847 0.084830 0.094984 0.084319
qa: -0.4109 -0.3880 -0.4091 -0.3771 -0.2299 0.5591 0.5313 0.3138 -0.1626 -0.3264 -0.3283 -0.3632 0.1010 0.0402 0.0121 -0.0130 -0.0761 0.0125 -0.0791 -0.3113 -0.2878 0.0865 0.0994 0.1051 0.0992 0.0993 0.1056 0.0987 0.1028 0.1043 0.1089 0.1434 0.1489 0.1864 0.0755 0.0700 0.0939 0.1022 0.0988 0.0848 0.0950 0.0843
va: 1.8524 1.8463 1.8227 1.8560 3.2011 4.0724 4.0930 3.6552 3.9669 3.9207 3.9178 3.9334 3.8487 4.2600 4.0045 3.9539 3.9756 3.9412 3.8543 3.9716 3.9507 1.0017 1.0022 1.0032 1.0031 1.0031 1.0025 1.0034 1.0061 1.0002 0.9992 1.0274 1.0187 1.0415 1.0083 1.0206 1.0044 1.0020 1.0011 0.9986 1.0035 0.9999
dispcorr: -0.021059414 hartree
energy: -1011.237864667308
dipole: -4.25914 3.19092 -1.06823 -6.30038 5.95575 -0.34463 8.10191 -7.24867 0.85324
magnitude: 1.40993 au
magnitude: 3.58375 debye
