program: Orca
programVersion: 5.0.2
elementType: O O O O N N N C C C C C C C C C C C C C C H H H H H H H H H H H H H H H H H H H H H
charge: 0
multiplicity: 1
keywords: wb97x-d3
keywords: def2-TZVPP
keywords: def2/J RIJCOSX
keywords: DEFGRID2
keywords: scfconv7
keywords: smallprint printgap noloewdin
keywords: NOSOSCF
formula: C14H21N3O4
InChI: InChI=1/C14H21N3O4/c1-6-9(2)15-13-11(16(18)19)7-10(14(3,4)5)8-12(13)17(20)21/h7-9,15H,6H2,1-5H3
42 atoms
O  -0.390347 3.602372 0.239521
O  1.261033 -2.309491 1.774395
O  1.359438 2.862294 1.195583
O  0.59643 -3.203893 -0.049599
N  2.04036 0.322484 0.779497
N  0.299511 2.683364 0.62073
N  0.702242 -2.264333 0.703399
C  -3.506365 -0.194124 -0.709169
C  -2.060891 -0.017828 -0.265441
C  -3.52249 -0.851141 -2.094707
C  -4.241988 1.14101 -0.79292
C  -4.241408 -1.092749 0.292266
C  3.130043 -0.468664 0.198908
C  0.721058 0.22358 0.532036
C  -1.491657 1.203148 0.02073
C  -1.241785 -1.133435 -0.093493
C  -0.155729 1.337521 0.402985
C  0.060152 -1.016454 0.334349
C  3.488918 0.028598 -1.201837
C  4.313979 -0.396322 1.147444
C  2.383715 -0.160596 -2.230097
H  2.847877 -1.513765 0.103116
H  -3.03625 -1.828372 -2.092334
H  -4.549943 -1.001017 -2.432888
H  -3.015549 -0.229216 -2.834943
H  -3.784947 1.821053 -1.514588
H  -5.270496 0.972437 -1.115658
H  -4.286291 1.649683 0.172244
H  -5.281204 -1.227318 -0.012603
H  -3.795576 -2.086316 0.363127
H  -4.241733 -0.656405 1.292859
H  -2.084956 2.101963 -0.053101
H  -1.647071 -2.126483 -0.241542
H  2.337874 1.258519 1.016167
H  4.375709 -0.525465 -1.522738
H  3.785058 1.081288 -1.15102
H  4.058105 -0.795617 2.129095
H  5.149313 -0.975755 0.755273
H  4.6563 0.63307 1.276631
H  1.523919 0.485287 -2.046502
H  2.74666 0.074493 -3.231617
H  2.028616 -1.19384 -2.246769
elementType: O N C H
totalener: -1011.22575149 hartree
nucrepener: 1831.50169585 hartree
electener: -2842.72744733 hartree
oneelecener: -5013.78691378 hartree
twoeener: 2171.05946644 hartree
cpcmener: -0.02356393 hartree
kineticenergy: 1007.00122934 hartree
xcener: -95.919125540831 hartree
chargesum: 0.0000000
charge: -0.401925 -0.366852 -0.406942 -0.373650 -0.208630 0.547903 0.527845 0.306659 -0.159430 -0.323498 -0.360220 -0.323389 0.105433 -0.020444 0.035792 -0.036205 -0.022579 -0.028771 -0.115497 -0.274466 -0.269650 0.083213 0.099838 0.098952 0.104742 0.105991 0.101825 0.105637 0.098018 0.096951 0.105110 0.145254 0.141516 0.184479 0.069614 0.067632 0.099613 0.094106 0.093691 0.086395 0.102781 0.083159
qa: -0.4019 -0.3669 -0.4069 -0.3737 -0.2086 0.5479 0.5278 0.3067 -0.1594 -0.3235 -0.3602 -0.3234 0.1054 -0.0204 0.0358 -0.0362 -0.0226 -0.0288 -0.1155 -0.2745 -0.2696 0.0832 0.0998 0.0990 0.1047 0.1060 0.1018 0.1056 0.0980 0.0970 0.1051 0.1453 0.1415 0.1845 0.0696 0.0676 0.0996 0.0941 0.0937 0.0864 0.1028 0.0832
va: 1.8622 1.8634 1.8251 1.8659 3.1976 4.0906 4.1141 3.6676 3.9415 3.9154 3.9332 3.9179 3.8351 4.2237 3.8743 4.0814 3.9341 3.8819 3.8814 3.9417 3.9302 1.0120 1.0026 1.0032 1.0040 0.9999 1.0066 1.0004 1.0033 1.0041 1.0036 1.0296 1.0206 1.0394 1.0112 1.0149 1.0101 1.0048 1.0024 0.9964 1.0051 1.0082
dispcorr: -0.022256957 hartree
energy: -1011.248008443219
dipole: -7.22079 6.51121 -0.70958 -4.12646 3.70970 -0.41676 -13.37029 12.23704 -1.13325
magnitude: 1.40052 au
magnitude: 3.55984 debye
