program: Gaussian 09
title: 000059185
version: EM64L-G09RevD.01
frameworkgroup: C1[X(C11H15NO2S)]
method: RPBEPBE
basis: SDD
operation: Freq
keyword: #p
keyword: freq=noraman
keyword: PBEPBE/SDD
title: #p freq=noraman PBEPBE/SDD
converged: YES YES NO NO
title: Mulliken charges:
elementType: S O O N C C C C C C C C C C C H H H H H H H H H H H H H H H
charge: 0.173037 -0.272314 -0.254910 -0.001321 -0.626867 -0.337690 -0.645784 -0.233596 -0.669828 0.214527 0.213957 -0.260986 -0.415935 -0.180302 -0.316404 0.245141 0.242497 0.219120 0.216440 0.268420 0.243602 0.247311 0.237960 0.210019 0.224058 0.209297 0.278445 0.287373 0.237844 0.246892
chargesum: 0.00000
title: Mulliken charges with hydrogens summed into heavy atoms:
elementType: S O O N C C C C C C C C C C C
charge: 0.173037 -0.272314 -0.254910 -0.001321 -0.139229 0.097871 -0.133763 0.251675 -0.026454 0.214527 0.213957 0.017459 -0.128562 0.057541 -0.069512
polarizability: 2.10163543e+02 4.74891668e+00 1.50949816e+02 9.90483395e+00 -4.03799131e+00 9.18285696e+01
1716.lowfreq: -3.3921 -0.0009 0.0007 0.0008 3.7411 8.9202 16.1718 21.4873 28.2297
frequency: 15.9210 21.4293 28.1190 45.1901 61.9649 92.4520 98.0670 104.3894 129.4942 185.3798 224.7880 237.9478 244.8554 273.2687 333.4274 348.3327 377.9471 420.0473 431.3934 478.6559 609.0883 637.7189 686.1165 697.8534 705.6956 719.8522 752.5766 780.9613 832.9890 841.3728 860.9166 901.1634 933.1534 942.5644 967.7267 984.7870 999.5270 1006.1043 1021.8419 1048.1619 1049.0226 1064.4942 1081.6106 1106.9239 1107.3297 1173.8904 1195.9695 1214.8504 1218.6522 1244.9856 1254.0203 1288.3121 1295.0463 1310.9523 1328.4086 1339.7531 1363.5668 1390.3717 1408.0121 1438.1791 1454.2997 1455.4572 1462.0046 1475.7619 1478.4167 1485.8497 1550.7910 1585.7311 1617.8772 2976.6775 2989.2057 2997.7976 3003.7263 3016.1411 3035.4956 3064.9650 3072.0722 3079.2500 3081.7177 3090.6812 3134.9389 3153.9369 3163.7157 3174.2468
redmass: 4.8958 4.5367 3.0896 2.5169 5.4128 4.7962 2.9459 3.6897 5.2145 4.4894 1.1075 4.2351 2.8678 3.0244 4.4655 5.3022 2.9016 4.2551 4.6136 5.0488 7.8828 4.2079 7.5342 7.1419 4.5697 1.8231 1.0846 3.2148 1.7360 4.4964 1.2134 1.9769 2.4017 1.3616 1.5068 1.5663 3.6595 1.3826 4.2970 1.1889 2.8084 2.1356 3.9714 1.7056 2.0358 1.1895 1.3244 1.2612 1.3717 1.4924 1.9574 1.1038 1.2671 11.0272 1.2593 1.4275 1.4508 1.2057 2.1345 1.0987 1.0905 2.0075 1.1188 1.0499 1.0424 1.0814 5.9334 5.9034 11.4472 1.0355 1.0592 1.0565 1.0569 1.0589 1.1015 1.1052 1.1064 1.0992 1.1047 1.1068 1.0887 1.0914 1.0931 1.1004
irintensity: 0.7778 0.4031 0.6737 0.2454 4.7641 0.9262 2.0190 0.4392 0.5325 2.1171 0.0406 10.4723 5.3538 1.3420 0.2638 2.1774 0.5163 6.9991 3.6953 6.9944 1.6431 3.0670 2.6461 6.3193 6.2546 58.7694 10.7303 3.7076 21.9426 5.5339 0.3215 8.1106 18.8974 1.0655 2.1258 1.6694 38.0126 0.6579 10.1423 2.5706 2.1246 5.8218 348.0048 4.1844 13.1900 0.5788 7.1377 0.1202 0.1620 219.1191 189.4331 0.4040 14.0015 1.1706 2.3244 3.5527 5.8620 13.0850 28.7314 12.1914 3.3340 18.1358 8.4614 3.6290 13.5324 13.0399 0.3398 31.5590 221.1862 36.6180 3.1737 56.0022 7.9192 33.1772 0.1733 0.0121 8.2337 44.0300 103.9676 15.3901 10.7376 8.1749 4.9254 17.9306
temp: 298.150 k
press: 1.00000 atm
elementType: 16 8 8 7 6 6 6 6 6 6 6 6 6 6 6 1 1 1 1 1 1 1 1 1 1 1 1 1 1 1
symmnumber: 1
zpe: 631379.1 jmol-1
zpe.correction: 0.240480 hartree
zpe.thermalcorrener: 0.256832 hartree
zpe.thermalcorrenthalpy: 0.257776 hartree
zpe.thermalcorrgfe: 0.192113 hartree
zpe.sumelectzpe: -1030.283238 hartree
zpe.sumelectthermal: -1030.266886 hartree
zpe.sumelectthermalent: -1030.265942 hartree
zpe.sumelectthermalfe: -1030.331605 hartree
dipole: 1.5042 1.3574 0.8952
dipole: 2.2151
quadrupole: -70.3930 -103.6337 -98.0338
quadrupole: 4.4065 4.8594 4.8439
quadrupole: 20.2938 -12.9469 -7.3470 4.4065 4.8594 4.8439
hfenergy: -1030.5237176 hartree
pointgroup: C01 [X(C11H15N1O2S1)]
dipole: -0.5988878 -0.5203982 0.3605401 debye
polarizability: 210.2094927|3.6775356|150.8912413|-10.4309454|3.5576929|91.8411952 unknown
InChI: InChI=1S/C11H15NO2S/c1-2-7-15-8-6-14-11(13)10-4-3-5-12-9-10/h3-5,9H,2,6-8H2,1H3
charge 0 multiplicity 1
30 atoms
S  -2.748457 0.102493 -0.287975
O  0.170883 -0.884607 0.350675
O  1.698348 -2.430105 -0.494592
N  2.930971 2.206721 0.42583
C  -4.569544 0.141066 0.249856
C  -5.305968 1.263231 -0.502145
C  -2.164429 -1.308025 0.835304
C  -0.885761 -1.934039 0.298789
C  -6.796135 1.340049 -0.098584
C  2.409344 -0.140551 -0.040888
C  1.434873 -1.267683 -0.097597
C  3.753774 -0.38458 -0.41966
C  2.045584 1.169685 0.370756
C  4.677183 0.678548 -0.368515
C  4.223777 1.949233 0.060238
H  -4.601483 0.313464 1.340969
H  -5.016118 -0.845414 0.026585
H  -4.810306 2.230376 -0.291827
H  -5.221959 1.091729 -1.592759
H  -2.014595 -0.920783 1.857103
H  -2.957225 -2.077782 0.848819
H  -0.994643 -2.277601 -0.745432
H  -0.561083 -2.789207 0.920845
H  -6.90729 1.538039 0.983956
H  -7.309119 2.1521 -0.644746
H  -7.322477 0.394215 -0.326401
H  4.041669 -1.390274 -0.742735
H  1.014001 1.391084 0.659748
H  5.723943 0.533764 -0.652054
H  4.911142 2.801154 0.116537
