program: Orca
programVersion: 5.0.2
elementType: O O O O N N N C C C C C C C C C C C C C C H H H H H H H H H H H H H H H H H H H H H
charge: 0
multiplicity: 1
keywords: wb97x-d3
keywords: def2-TZVPP
keywords: def2/J RIJCOSX
keywords: DEFGRID2
keywords: scfconv7
keywords: smallprint printgap noloewdin
keywords: NOSOSCF
formula: C14H21N3O4
InChI: InChI=1/C14H21N3O4/c1-6-9(2)15-13-11(16(18)19)7-10(14(3,4)5)8-12(13)17(20)21/h7-9,15H,6H2,1-5H3
42 atoms
O  -0.600078 3.607702 0.259867
O  1.346303 -2.074291 -1.77911
O  1.322538 2.995251 -0.408119
O  0.477483 -3.177435 -0.16815
N  1.954193 0.431363 -0.354225
N  0.171806 2.743959 -0.090901
N  0.659622 -2.155584 -0.787228
C  -3.744157 -0.264703 0.227857
C  -2.248847 -0.04467 0.040062
C  -4.308353 -1.006074 -0.989434
C  -4.49643 1.055516 0.38079
C  -3.970728 -1.104892 1.490062
C  2.986241 -0.469037 0.173564
C  0.617702 0.291879 -0.30396
C  -1.660398 1.201159 0.016657
C  -1.395624 -1.129766 -0.150628
C  -0.286435 1.381417 -0.140159
C  -0.045093 -0.961106 -0.362649
C  4.308882 0.291132 0.071649
C  2.682231 -0.901525 1.602385
C  5.520835 -0.549479 0.436159
H  3.084386 -1.35182 -0.460137
H  -5.381928 -1.166088 -0.870702
H  -4.156609 -0.435502 -1.907621
H  -3.849734 -1.986837 -1.127883
H  -4.397145 1.692787 -0.500423
H  -5.560559 0.855967 0.516258
H  -4.162127 1.625026 1.250483
H  -5.037666 -1.280208 1.643315
H  -3.487921 -2.081954 1.42773
H  -3.586059 -0.599818 2.378206
H  -2.273107 2.08245 0.129028
H  -1.801562 -2.132921 -0.193649
H  2.249264 1.395547 -0.399448
H  4.265808 1.178008 0.712816
H  4.420959 0.650552 -0.955306
H  3.422373 -1.624752 1.944298
H  2.703622 -0.045777 2.280007
H  1.70902 -1.381866 1.707048
H  5.570938 -1.458679 -0.166353
H  6.43937 0.010731 0.258166
H  5.522022 -0.844356 1.485928
elementType: O N C H
totalener: -1011.22584430 hartree
nucrepener: 1805.68429099 hartree
electener: -2816.91013529 hartree
oneelecener: -4962.21762825 hartree
twoeener: 2145.30749295 hartree
cpcmener: -0.02253307 hartree
kineticenergy: 1006.99553211 hartree
xcener: -95.919804785788 hartree
chargesum: 0.0000000
charge: -0.403535 -0.370719 -0.406481 -0.373453 -0.223173 0.546866 0.543281 0.305308 -0.173063 -0.323702 -0.360798 -0.322216 0.089227 0.076039 0.050284 -0.028565 -0.050624 -0.091154 -0.115519 -0.279293 -0.285795 0.082485 0.098423 0.105002 0.097202 0.105486 0.101946 0.106238 0.098461 0.099134 0.104514 0.145729 0.141487 0.189330 0.075141 0.088158 0.100986 0.092699 0.100226 0.084680 0.095240 0.084519
qa: -0.4035 -0.3707 -0.4065 -0.3735 -0.2232 0.5469 0.5433 0.3053 -0.1731 -0.3237 -0.3608 -0.3222 0.0892 0.0760 0.0503 -0.0286 -0.0506 -0.0912 -0.1155 -0.2793 -0.2858 0.0825 0.0984 0.1050 0.0972 0.1055 0.1019 0.1062 0.0985 0.0991 0.1045 0.1457 0.1415 0.1893 0.0751 0.0882 0.1010 0.0927 0.1002 0.0847 0.0952 0.0845
va: 1.8612 1.8692 1.8241 1.8689 3.2306 4.0938 4.1044 3.6657 3.9632 3.9160 3.9335 3.9139 3.8456 4.1685 3.8463 4.0803 4.0039 3.9602 3.8665 3.9105 3.9556 1.0112 1.0033 1.0037 1.0039 1.0003 1.0067 0.9997 1.0033 1.0029 1.0038 1.0314 1.0207 1.0416 1.0117 1.0108 1.0059 1.0055 1.0090 1.0002 1.0035 0.9993
dispcorr: -0.021103577 hartree
energy: -1011.246947879288
dipole: -4.17932 3.36115 -0.81818 -6.60814 6.08918 -0.51895 9.32679 -8.51558 0.81121
magnitude: 1.26364 au
magnitude: 3.21191 debye
