program: Orca
programVersion: 5.0.2
elementType: O O O O N N N C C C C C C C C C C C C C C H H H H H H H H H H H H H H H H H H H H H
charge: 0
multiplicity: 1
keywords: wb97x-d3
keywords: def2-TZVPP
keywords: def2/J RIJCOSX
keywords: DEFGRID2
keywords: scfconv7
keywords: smallprint printgap noloewdin
keywords: NOSOSCF
formula: C14H21N3O4
InChI: InChI=1/C14H21N3O4/c1-6-9(2)15-13-11(16(18)19)7-10(14(3,4)5)8-12(13)17(20)21/h7-9,15H,6H2,1-5H3
42 atoms
O  -0.203517 3.492305 -0.118459
O  1.104127 -2.43623 1.713999
O  1.456277 2.70089 0.961104
O  0.248928 -3.359079 -0.020596
N  1.971216 0.101938 0.642476
N  0.402282 2.569465 0.366078
N  0.481194 -2.404691 0.682631
C  -3.665335 -0.106788 -0.576584
C  -2.182996 -0.009843 -0.24251
C  -4.30576 1.273204 -0.722085
C  -4.388219 -0.860227 0.547605
C  -3.839233 -0.864158 -1.898847
C  2.967104 -0.739694 -0.017029
C  0.63933 0.080747 0.415835
C  -1.517047 1.183389 -0.06152
C  -1.426602 -1.166717 -0.064518
C  -0.160402 1.240889 0.248955
C  -0.097853 -1.122182 0.290106
C  3.503097 -0.062328 -1.287738
C  4.063265 -1.101789 0.973089
C  4.26477 1.238706 -1.076488
H  2.495506 -1.660888 -0.355855
H  -4.245508 1.854728 0.199474
H  -3.849546 1.855847 -1.524317
H  -5.363503 1.164188 -0.96374
H  -4.007211 -1.873953 0.67843
H  -4.282168 -0.341948 1.501416
H  -5.453922 -0.942383 0.326949
H  -4.897694 -0.951671 -2.150319
H  -3.341773 -0.345362 -2.719254
H  -3.433556 -1.875777 -1.853248
H  -2.041604 2.120329 -0.170144
H  -1.894387 -2.138504 -0.154068
H  2.315879 1.00864 0.918444
H  2.663765 0.110247 -1.967465
H  4.153314 -0.783262 -1.791288
H  3.657321 -1.674966 1.803464
H  4.834764 -1.699834 0.487845
H  4.544122 -0.213053 1.384038
H  5.141247 1.102785 -0.442648
H  4.618139 1.628614 -2.030484
H  3.645876 2.017591 -0.629366
totalener: -1011.21167577 hartree
nucrepener: 1814.25726391 hartree
electener: -2825.46893968 hartree
oneelecener: -4979.65836766 hartree
twoeener: 2154.18942798 hartree
kineticenergy: 1007.03391399 hartree
xcener: -95.920517083201 hartree
chargesum: 0.0000000
charge: -0.336016 -0.309433 -0.367414 -0.329437 -0.241644 0.508597 0.462269 0.228627 -0.084240 -0.334474 -0.288514 -0.289921 0.068020 0.084921 0.012177 -0.076712 -0.074667 -0.060596 -0.120140 -0.262991 -0.265386 0.093519 0.098366 0.103100 0.095185 0.089256 0.103402 0.091446 0.091703 0.101763 0.093333 0.143252 0.123248 0.173290 0.072717 0.070615 0.114707 0.087654 0.080629 0.082210 0.091247 0.076331
qa: -0.3360 -0.3094 -0.3674 -0.3294 -0.2416 0.5086 0.4623 0.2286 -0.0842 -0.3345 -0.2885 -0.2899 0.0680 0.0849 0.0122 -0.0767 -0.0747 -0.0606 -0.1201 -0.2630 -0.2654 0.0935 0.0984 0.1031 0.0952 0.0893 0.1034 0.0914 0.0917 0.1018 0.0933 0.1433 0.1232 0.1733 0.0727 0.0706 0.1147 0.0877 0.0806 0.0822 0.0912 0.0763
va: 1.9198 1.9120 1.8603 1.8905 3.1832 4.1004 4.1552 3.7876 3.8254 3.9351 3.9161 3.9171 3.9077 4.1431 3.9280 4.1382 4.0220 4.0997 3.9067 3.9513 3.9384 0.9997 1.0030 1.0017 1.0105 1.0074 1.0060 1.0066 1.0061 1.0061 1.0058 1.0303 1.0318 1.0618 1.0060 1.0093 1.0146 1.0056 1.0003 0.9992 1.0076 1.0195
dispcorr: -0.021642180 hartree
energy: -1011.233317950131
dipole: -4.59977 3.94920 -0.65057 -1.27800 1.12481 -0.15318 -9.69391 8.97683 -0.71708
magnitude: 0.98025 au
magnitude: 2.49161 debye
