program: Gaussian 09
title: 000059206
version: EM64L-G09RevD.01
frameworkgroup: C1[X(C17H26N2)]
method: RPBEPBE
basis: SDD
operation: Freq
keyword: #pfreq=noraman
keyword: PBEPBE/SDD
title: #p freq=noraman PBEPBE/SDD
converged: YES YES NO NO
title: Mulliken charges:
elementType: N N C C C C C C C C C C C C C C C C C H H H H H H H H H H H H H H H H H H H H H H H H H H
charge: -0.147327 -0.043265 0.290089 -0.518687 -0.498738 -0.354645 -0.374554 -0.406781 -0.410628 0.444311 -0.401885 -0.401010 -0.405081 -0.351081 -0.369900 -0.618237 -0.281036 -0.272241 -0.243817 0.190837 0.237701 0.230871 0.180593 0.198346 0.194346 0.196860 0.206762 0.203759 0.199167 0.201787 0.201264 0.199296 0.189019 0.188872 0.199763 0.191022 0.213161 0.217723 0.224884 0.220301 0.220791 0.185066 0.222966 0.222397 0.226958
chargesum: 0.00000
title: Mulliken charges with hydrogens summed into heavy atoms:
elementType: N N C C C C C C C C C C C C C C C C C
charge: -0.147327 -0.043265 0.290089 -0.090149 -0.087273 0.038048 0.029068 -0.003855 -0.007576 0.444311 -0.013571 -0.012375 -0.000898 -0.133358 -0.145016 0.007920 -0.058069 -0.049844 -0.016859
polarizability: 2.27658428e+02 7.64967515e+00 1.66578027e+02 -2.16641381e-01 -4.54876853e+00 1.76603500e+02
1716.lowfreq: -10.1264 0.0005 0.0006 0.0009 8.7492 14.0027 17.3290 52.2343 60.2570
frequency: 15.0448 52.1334 60.2532 62.3894 127.4354 137.4227 152.2004 187.6153 216.6048 235.0585 236.9949 265.4056 299.3169 304.8731 306.8321 335.7568 349.7414 379.8063 396.3559 402.7488 441.5657 444.9117 468.7416 500.6791 506.7772 537.6953 576.4220 617.5541 639.5948 674.2360 703.1978 746.3705 764.6861 804.0724 807.5413 808.7096 847.8515 848.4665 856.9087 896.5473 909.6736 920.6263 941.3940 951.5073 956.1596 971.3128 990.2538 991.2559 993.6502 1013.4471 1030.9692 1032.7695 1058.4703 1064.1914 1072.5761 1077.5763 1084.8419 1088.3100 1119.4264 1129.8717 1134.2902 1143.3725 1146.8348 1153.6273 1172.1582 1189.4598 1191.2036 1199.9971 1205.4985 1242.9459 1256.3809 1264.8656 1267.5763 1291.5646 1293.2482 1304.0570 1318.3818 1326.4424 1334.2394 1339.7393 1347.6436 1350.2478 1351.4066 1361.4652 1373.8488 1375.4945 1381.7711 1427.7978 1433.0910 1450.9252 1455.2886 1456.3850 1458.7242 1459.6970 1465.7319 1471.9371 1474.8161 1476.5433 1480.4323 1482.8838 1485.8878 1584.9734 1608.3170 2843.2780 2854.0775 2858.5513 2866.1550 2873.5165 2967.1008 2979.3977 2980.2741 3000.1933 3004.1566 3012.2908 3016.2397 3022.7364 3030.2886 3038.3660 3048.7088 3056.8687 3061.6179 3067.9933 3070.9124 3074.5202 3118.8324 3126.8604 3144.3315 3150.8397 3163.1669
redmass: 3.2103 3.4409 3.8506 3.3409 3.0940 2.7999 2.6288 2.8203 1.9456 1.3553 2.6854 5.7260 2.5965 3.2404 2.3562 2.0633 1.9691 2.5703 2.0275 2.7914 2.6192 2.8640 2.6462 2.1245 3.2818 2.4690 2.6564 6.3212 3.0263 3.8673 1.6050 3.3754 2.1801 1.5068 2.5588 1.5903 1.4401 1.6274 1.8593 2.3402 2.4081 1.8153 2.0038 2.6435 1.3508 1.3937 4.8311 1.3103 2.7762 1.6437 2.3740 2.2426 2.3315 1.8516 2.0148 1.6084 1.5737 1.6749 2.8926 1.8757 2.3796 2.4493 1.2408 2.4358 1.0666 1.8565 1.4127 1.7389 1.3215 2.3625 1.2641 1.2892 1.1853 1.7829 1.3541 1.4085 1.3427 1.3009 1.4056 1.4279 1.4832 1.4406 1.4804 1.3114 1.3523 5.6042 1.3573 1.1799 2.2633 1.0892 1.0771 1.0884 1.0794 1.0657 1.0900 1.0815 1.0953 1.1062 1.0565 1.6594 1.2501 5.7871 5.9725 1.0586 1.0712 1.0700 1.0707 1.0680 1.0615 1.0595 1.0629 1.0712 1.0774 1.0718 1.0764 1.0741 1.0969 1.1026 1.1026 1.0929 1.0944 1.0903 1.1008 1.0961 1.0842 1.0877 1.0915 1.0941 1.1005
irintensity: 0.1001 0.1023 0.3774 0.0740 1.4240 0.3199 0.2497 1.1697 0.3561 0.4913 1.7598 0.3483 0.6043 0.0983 5.3067 9.7339 1.8931 2.4940 7.7958 0.0266 3.7329 0.7711 0.4157 2.9846 0.1678 8.0209 16.1342 0.0471 2.4845 7.1370 58.6738 12.3551 14.2706 0.5101 4.9709 0.6432 1.4453 1.2734 7.2531 10.5741 2.0579 9.8810 3.2305 31.4284 2.4840 0.1545 1.6818 0.1290 32.2219 0.5349 5.0392 4.3636 8.4653 1.1870 9.4638 13.0171 13.6979 23.0648 7.3407 12.4329 1.8289 9.0453 3.2818 30.5141 0.0086 0.7351 0.7013 1.8413 6.9242 12.3917 1.4682 0.6730 3.3366 16.7141 4.5509 17.1420 0.4572 3.8171 0.1680 0.0543 1.3192 4.4916 7.1327 4.9471 0.5454 0.3491 2.3586 0.1432 8.2335 7.6567 1.5460 4.2208 6.7463 41.4858 5.3546 8.9645 17.5436 6.5911 6.2153 41.1127 3.7507 1.8620 10.7825 95.6250 39.4973 57.6321 82.8108 150.0826 35.2339 52.4547 32.2397 9.9050 46.5843 54.5294 64.5915 42.8005 71.7613 33.1884 69.3013 9.1358 57.5303 39.5437 39.0062 30.5670 3.2512 4.1128 30.2872 45.9995 16.2513
temp: 298.150 k
press: 1.00000 atm
elementType: 7 7 6 6 6 6 6 6 6 6 6 6 6 6 6 6 6 6 6 1 1 1 1 1 1 1 1 1 1 1 1 1 1 1 1 1 1 1 1 1 1 1 1 1 1
symmnumber: 1
zpe: 1045759.1 jmol-1
zpe.correction: 0.398309 hartree
zpe.thermalcorrener: 0.415959 hartree
zpe.thermalcorrenthalpy: 0.416903 hartree
zpe.thermalcorrgfe: 0.352658 hartree
zpe.sumelectzpe: -771.413279 hartree
zpe.sumelectthermal: -771.395629 hartree
zpe.sumelectthermalent: -771.394685 hartree
zpe.sumelectthermalfe: -771.458929 hartree
dipole: -0.0420 1.1189 -0.0389
dipole: 1.1204
quadrupole: -112.0972 -122.0527 -108.9787
quadrupole: 0.7394 -0.2083 -1.1348
quadrupole: 2.2790 -7.6765 5.3975 0.7394 -0.2083 -1.1348
hfenergy: -771.8115873 hartree
pointgroup: C01 [X(C17H26N2)]
dipole: -0.1038786 0.4273848 -0.0291045 debye
polarizability: 222.2622361|18.9320659|171.6748418|-0.2209557|-4.4487048|176.9028765 unknown
InChI: InChI=1S/C17H26N2/c1-18-14-10-17(11-15-18,16-8-4-2-5-9-16)19-12-6-3-7-13-19/h2,4-5,8-9H,3,6-7,10-15H2,1H3
charge 0 multiplicity 1
45 atoms
N  0.297058 0.968441 -0.003519
N  3.205674 -1.187986 0.010163
C  0.260271 -0.55243 0.018408
C  1.038391 -1.133848 -1.204942
C  1.055908 -1.062302 1.262642
C  -0.35835 1.636505 1.154453
C  -0.122963 1.629426 -1.267091
C  2.522362 -0.723733 -1.219463
C  2.539591 -0.65377 1.2218
C  -1.20844 -1.062421 0.024443
C  0.052703 3.122905 1.238373
C  0.29248 3.1180 -1.272901
C  -0.310918 3.86662 -0.064987
C  -1.960452 -1.132887 -1.181416
C  -1.884368 -1.386402 1.232009
C  4.649295 -0.890534 -0.009233
C  -3.320177 -1.512706 -1.182801
C  -3.244295 -1.768584 1.237864
C  -3.973038 -1.833651 0.029121
H  0.578726 -0.853794 -2.168146
H  0.977871 -2.235908 -1.134502
H  0.986867 -2.166289 1.277583
H  0.623902 -0.699723 2.21192
H  -0.063487 1.128183 2.086873
H  -1.473203 1.571958 1.08323
H  -1.230791 1.563883 -1.416598
H  0.35606 1.126166 -2.122752
H  3.021641 -1.191092 -2.090372
H  2.604789 0.386889 -1.336085
H  2.613738 0.461842 1.268027
H  3.056843 -1.066466 2.109555
H  1.145763 3.183294 1.407644
H  -0.44897 3.589982 2.108462
H  -0.034191 3.58152 -2.22439
H  1.397829 3.177942 -1.231221
H  -1.415165 3.904023 -0.170032
H  0.047316 4.913128 -0.033177
H  -1.481864 -0.902785 -2.139086
H  -1.347701 -1.354591 2.185684
H  5.115879 -1.362445 -0.893144
H  5.12862 -1.308682 0.894569
H  4.876643 0.206363 -0.0438
H  -3.868197 -1.561635 -2.130973
H  -3.732793 -2.018762 2.186918
H  -5.02726 -2.132544 0.030793
