program: Orca
programVersion: 5.0.2
elementType: S P O O O O N N C C C C C C C C C C C C C H H H H H H H H H H H H H H H H H H H H H
charge: 0
multiplicity: 1
keywords: wb97x-d3
keywords: def2-TZVPP
keywords: def2/J RIJCOSX
keywords: DEFGRID2
keywords: scfconv7
keywords: smallprint printgap noloewdin
keywords: NOSOSCF
formula: C13H21N2O4PS
InChI: InChI=1/C13H21N2O4PS/c1-5-11(4)14-20(21,18-6-2)19-13-9-10(3)7-8-12(13)15(16)17/h7-9,11,14H,5-6H2,1-4H3
42 atoms
S  0.735213 1.987174 1.883975
P  0.891534 1.222865 0.120482
O  -0.531229 0.904028 -0.650031
O  1.511952 2.1931 -0.991591
O  -1.382577 -2.132066 -3.181101
O  0.133167 -0.754705 -2.600693
N  1.677719 -0.205301 0.043571
N  -0.877829 -1.382258 -2.375354
C  2.728219 -0.644439 0.962179
C  2.560432 -2.132898 1.247102
C  4.107239 -0.310642 0.415934
C  1.232485 -2.482382 1.900222
C  -1.342637 -0.120927 -0.274023
C  1.341825 3.625238 -0.9656
C  -1.531545 -1.240421 -1.092618
C  -2.063628 -0.022956 0.904716
C  -2.938077 -1.025477 1.308413
C  -2.407256 -2.246977 -0.699209
C  -3.085932 -2.149176 0.496493
C  -0.060825 4.06165 -1.310155
C  -3.728252 -0.87612 2.567963
H  2.579255 -0.099415 1.896752
H  3.381831 -2.441336 1.898704
H  2.683038 -2.695085 0.315479
H  1.692741 -0.666163 -0.860045
H  4.8861 -0.622462 1.11276
H  4.212416 0.763046 0.254213
H  4.28729 -0.814928 -0.535798
H  0.385947 -2.257138 1.249972
H  1.185471 -3.544282 2.143135
H  1.09143 -1.926292 2.828963
H  2.05377 4.000102 -1.698794
H  1.638301 4.002653 0.014772
H  -1.944694 0.865012 1.51187
H  -2.550673 -3.117999 -1.322146
H  -3.751738 -2.948015 0.794757
H  -0.782873 3.77012 -0.547069
H  -0.383699 3.661965 -2.271189
H  -0.080367 5.149859 -1.378265
H  -4.007732 -1.843592 2.981582
H  -4.650946 -0.326704 2.369706
H  -3.176527 -0.319406 3.323906
elementType: S P O N C H
totalener: -1658.11131364 hartree
nucrepener: 2220.00412038 hartree
electener: -3878.11543402 hartree
oneelecener: -6690.42821534 hartree
twoeener: 2812.31278132 hartree
cpcmener: -0.02698375 hartree
kineticenergy: 1652.73500236 hartree
xcener: -123.704585144423 hartree
chargesum: 0.0000000
charge: -0.472067 0.708390 -0.366013 -0.373858 -0.398695 -0.402489 -0.258436 0.572191 0.088118 -0.094950 -0.282859 -0.254660 0.213782 0.031914 -0.005277 -0.130620 -0.004990 -0.098852 -0.152475 -0.239087 -0.193444 0.069294 0.068759 0.068586 0.180473 0.091304 0.090169 0.089860 0.049522 0.099062 0.080089 0.112263 0.090670 0.135670 0.158610 0.149911 0.076342 0.088719 0.100737 0.100387 0.111380 0.102570
qa: -0.4721 0.7084 -0.3660 -0.3739 -0.3987 -0.4025 -0.2584 0.5722 0.0881 -0.0950 -0.2829 -0.2547 0.2138 0.0319 -0.0053 -0.1306 -0.0050 -0.0989 -0.1525 -0.2391 -0.1934 0.0693 0.0688 0.0686 0.1805 0.0913 0.0902 0.0899 0.0495 0.0991 0.0801 0.1123 0.0907 0.1357 0.1586 0.1499 0.0763 0.0887 0.1007 0.1004 0.1114 0.1026
va: 1.9681 5.4191 2.0818 2.0798 1.8559 1.8341 3.1473 4.0822 3.8339 3.8433 3.9650 3.9458 3.9548 3.8509 3.8351 3.9287 3.8125 3.9803 3.9465 3.8881 3.8917 1.0365 1.0124 1.0119 1.0235 1.0073 1.0099 1.0038 1.0135 1.0084 1.0052 0.9910 1.0152 1.0218 1.0149 0.9976 1.0193 1.0083 1.0083 1.0025 0.9948 1.0009
dispcorr: -0.023343640 hartree
energy: -1658.134657283131
dipole: 7.12937 -7.78511 -0.65575 -3.29794 2.66193 -0.63600 13.35333 -12.08696 1.26636
magnitude: 1.56147 au
magnitude: 3.96894 debye
