program: Orca
programVersion: 5.0.2
elementType: S P O O O O N N C C C C C C C C C C C C C H H H H H H H H H H H H H H H H H H H H H
charge: 0
multiplicity: 1
keywords: wb97x-d3
keywords: def2-TZVPP
keywords: def2/J RIJCOSX
keywords: DEFGRID2
keywords: scfconv7
keywords: smallprint printgap noloewdin
keywords: NOSOSCF
formula: C13H21N2O4PS
InChI: InChI=1/C13H21N2O4PS/c1-5-11(4)14-20(21,18-6-2)19-13-9-10(3)7-8-12(13)15(16)17/h7-9,11,14H,5-6H2,1-4H3
42 atoms
S  0.834085 1.509078 1.799042
P  0.855385 0.211115 0.378298
O  -0.269502 -0.982328 0.482738
O  0.530933 0.796215 -1.084104
O  -0.399866 -2.072564 -1.990373
O  -1.510557 -0.766447 -3.263183
N  2.183877 -0.751191 0.309206
N  -1.274369 -1.260029 -2.183206
C  3.540765 -0.210865 0.452759
C  4.477086 -1.314375 0.930474
C  4.034189 0.427455 -0.837494
C  4.109343 -1.891726 2.287232
C  -1.581204 -0.725748 0.214121
C  0.260533 2.182052 -1.37388
C  -2.10253 -0.854561 -1.071368
C  -2.409707 -0.303854 1.241216
C  -3.753821 -0.032098 1.014236
C  -3.439156 -0.569149 -1.317507
C  -4.256486 -0.172641 -0.280434
C  -1.211962 2.498228 -1.303644
C  -4.646355 0.415239 2.127176
H  3.493068 0.554519 1.231425
H  5.484643 -0.893963 0.974322
H  4.511562 -2.108994 0.177588
H  2.12553 -1.50593 -0.369656
H  3.414487 1.276626 -1.129445
H  4.026701 -0.294009 -1.657059
H  5.055556 0.791525 -0.721088
H  3.145662 -2.399617 2.268278
H  4.854438 -2.617544 2.614419
H  4.057576 -1.11007 3.047473
H  0.646293 2.343788 -2.379365
H  0.827821 2.816083 -0.691519
H  -1.991216 -0.193667 2.233489
H  -3.842735 -0.671469 -2.31523
H  -5.300621 0.031764 -0.477981
H  -1.611976 2.337402 -0.3020
H  -1.787151 1.905432 -2.014032
H  -1.357213 3.54972 -1.554519
H  -5.050069 1.40799 1.923734
H  -4.117865 0.453638 3.077615
H  -5.497038 -0.2581 2.237407
elementType: S P O N C H
totalener: -1658.11130323 hartree
nucrepener: 2220.33474324 hartree
electener: -3878.44604647 hartree
oneelecener: -6691.19297171 hartree
twoeener: 2812.74692524 hartree
cpcmener: -0.02886694 hartree
kineticenergy: 1652.74199502 hartree
xcener: -123.701931404902 hartree
chargesum: 0.0000000
charge: -0.455824 0.659210 -0.370671 -0.363380 -0.388337 -0.389767 -0.235140 0.559645 0.091178 -0.095154 -0.280998 -0.275782 0.236252 0.045359 0.020217 -0.161341 0.002379 -0.152689 -0.131950 -0.243238 -0.193718 0.068626 0.067042 0.069355 0.157109 0.086986 0.091530 0.091944 0.078107 0.095006 0.078366 0.115376 0.093243 0.132486 0.156938 0.150270 0.077271 0.087721 0.112983 0.108754 0.095953 0.108684
qa: -0.4558 0.6592 -0.3707 -0.3634 -0.3883 -0.3898 -0.2351 0.5596 0.0912 -0.0952 -0.2810 -0.2758 0.2363 0.0454 0.0202 -0.1613 0.0024 -0.1527 -0.1319 -0.2432 -0.1937 0.0686 0.0670 0.0694 0.1571 0.0870 0.0915 0.0919 0.0781 0.0950 0.0784 0.1154 0.0932 0.1325 0.1569 0.1503 0.0773 0.0877 0.1130 0.1088 0.0960 0.1087
va: 1.9907 5.4794 2.1092 2.0317 1.8442 1.8506 3.1461 4.0691 3.8446 3.8450 3.9573 3.9380 3.9062 3.7932 3.7641 3.9863 3.7843 4.0044 3.9239 3.9239 3.8864 1.0340 1.0118 1.0109 1.0320 1.0080 1.0050 1.0081 1.0137 1.0054 1.0022 0.9919 1.0191 1.0202 1.0106 0.9958 1.0121 1.0078 1.0102 0.9963 1.0063 0.9966
dispcorr: -0.024192575 hartree
energy: -1658.135495809163
dipole: 11.46914 -12.58775 -1.11860 6.08656 -5.38077 0.70579 6.39900 -6.21781 0.18118
magnitude: 1.33501 au
magnitude: 3.39332 debye
